BDBM318951 2-[[7-(3-Cyanophenyl)benzo[d]isothiazol-6-yl]thio]-2-methylpropanoic acid::US10173990, Example 84
SMILES: CC(C)(Sc1ccc2cnsc2c1-c1cccc(c1)C#N)C(O)=O
InChI Key: InChIKey=IYMIGBBLVQSSFB-UHFFFAOYSA-N
Data: 1 IC50
Activity Spreadsheet -- Enzyme Inhibition Constant Data from BindingDB
Found 1 hit for monomerid = 318951
Trg + Lig
Ki
nM
ΔG°
kcal/mole
IC50
nM
Kd
nM
EC50/IC50
nM
koff
s-1
kon
M-1s-1
pHTemp
°C
Solute carrier family 22 member 12
(Homo sapiens (Human))
BDBM318951
(2-[[7-(3-Cyanophenyl)benzo[d]isothiazol-6-yl]thio]...)
Show SMILES CC(C)(Sc1ccc2cnsc2c1-c1cccc(c1)C#N)C(O)=O
Show InChI InChI=1S/C18H14N2O2S2/c1-18(2,17(21)22)23-14-7-6-13-10-20-24-16(13)15(14)12-5-3-4-11(8-12)9-19/h3-8,10H,1-2H3,(H,21,22)
US Patent
n/an/a 205n/an/an/an/an/an/a
Nippon Chemiphar Co., Ltd.; J-Pharma Co., Ltd.; DeThree Res. Lab. Inc.
US Patent
Assay Description
URAT1 stably expressed HEK293 cells (HEK-URAT1) or HEK293 cells transfected with empty vector (HEK-mock) were cultured in DMEM culture medium supplem...
US Patent US10173990 (2019)
BindingDB Entry DOI: 10.7270/Q2RR21BP