BDBM319013 US10173991, Example 54::benzyl N-(4-{2- [cyclohexyl- methanesulfonyl ({[(cyclopropyl- carbamoyl)methyl] carbamoyl}) methyl]-5-fluoro- 1,3-benzothiazol- 6-yl}phenyl) carbamate
SMILES: Fc1cc2nc(sc2cc1-c1ccc(NC(=O)OCc2ccccc2)cc1)C(C(=O)NCC(=O)NC1CC1)S(=O)(=O)CC1CCCCC1
InChI Key: InChIKey=DQTHCVWXEXMDGO-UHFFFAOYSA-N
Data: 1 IC50
Activity Spreadsheet -- Enzyme Inhibition Constant Data from BindingDB
Found 1 hit for monomerid = 319013
Trg + Lig
Ki
nM
ΔG°
kcal/mole
IC50
nM
Kd
nM
EC50/IC50
nM
koff
s-1
kon
M-1s-1
pHTemp
°C
Endothelial lipase
(Homo sapiens (Human))
BDBM319013
(US10173991, Example 54 | benzyl N-(4-{2- [cyclohex...)
Show SMILES Fc1cc2nc(sc2cc1-c1ccc(NC(=O)OCc2ccccc2)cc1)C(C(=O)NCC(=O)NC1CC1)S(=O)(=O)CC1CCCCC1
Show InChI InChI=1S/C35H37FN4O6S2/c36-28-18-29-30(17-27(28)24-11-13-26(14-12-24)39-35(43)46-20-22-7-3-1-4-8-22)47-34(40-29)32(33(42)37-19-31(41)38-25-15-16-25)48(44,45)21-23-9-5-2-6-10-23/h1,3-4,7-8,11-14,17-18,23,25,32H,2,5-6,9-10,15-16,19-21H2,(H,37,42)(H,38,41)(H,39,43)
US Patent
n/an/a 1n/an/an/an/an/an/a
Bristol-Myers Squibb Company
US Patent
Assay Description
Endothelial lipase (EL) and hepatic lipase (HL) activities were measured using a fluorescent substrate, A10070, (Invitrogen, CA) doped into an artifi...
US Patent US10173991 (2019)
BindingDB Entry DOI: 10.7270/Q2N018M8