BDBM31910 Cyclic CMP, 7
SMILES: Nc1ccn([C@@H]2O[C@@H]3COP(O)(=O)O[C@H]3[C@H]2O)c(=O)n1
InChI Key: InChIKey=WCPTXJJVVDAEMW-XVFCMESISA-N
Data: 1 Kd
PDB links: 1 PDB ID matches this monomer.
Activity Spreadsheet -- Enzyme Inhibition Constant Data from BindingDB
Found 1 hit for monomerid = 31910
Trg + Lig
Ki
nM
ΔG°
kcal/mole
IC50
nM
Kd
nM
EC50/IC50
nM
koff
s-1
kon
M-1s-1
pHTemp
°C
2C-methyl-D-erythritol-2,4-cyclodiphosphate synthase (IspF)
(Escherichia coli (strain K12))
BDBM31910
(Cyclic CMP, 7)
Show SMILES Nc1ccn([C@@H]2O[C@@H]3COP(O)(=O)O[C@H]3[C@H]2O)c(=O)n1 |r|
Show InChI InChI=1S/C9H12N3O7P/c10-5-1-2-12(9(14)11-5)8-6(13)7-4(18-8)3-17-20(15,16)19-7/h1-2,4,6-8,13H,3H2,(H,15,16)(H2,10,11,14)/t4-,6-,7-,8-/m1/s1
n/an/an/a 9.00E+5n/an/an/a7.010
University of Dundee
Assay Description
An SPR assay was used to determine the binding affinities of compounds. Experiments were performed on a Biacore 3000 (Biacore, Uppsala, Sweden) instr...
J Med Chem 52: 2531-42 (2009)
Article DOI: 10.1021/jm801475n
BindingDB Entry DOI: 10.7270/Q23B5XGB
3D
3D Structure (crystal)