BDBM31916 Tryptophanhydroxamate, 13
SMILES: N[C@@H](Cc1c[nH]c2ccccc12)C(=O)NO
InChI Key: InChIKey=LBMAEBPZXXNKMZ-VIFPVBQESA-N
Data: 1 Kd
PDB links: 1 PDB ID matches this monomer.
Activity Spreadsheet -- Enzyme Inhibition Constant Data from BindingDB
Found 1 hit for monomerid = 31916
Trg + Lig
Ki
nM
ΔG°
kcal/mole
IC50
nM
Kd
nM
EC50/IC50
nM
koff
s-1
kon
M-1s-1
pHTemp
°C
2C-methyl-D-erythritol-2,4-cyclodiphosphate synthase (IspF)
(Escherichia coli (strain K12))
BDBM31916
(Tryptophanhydroxamate, 13)
Show SMILES N[C@@H](Cc1c[nH]c2ccccc12)C(=O)NO |r|
Show InChI InChI=1S/C11H13N3O2/c12-9(11(15)14-16)5-7-6-13-10-4-2-1-3-8(7)10/h1-4,6,9,13,16H,5,12H2,(H,14,15)/t9-/m0/s1
n/an/an/a 1.92E+3n/an/an/a7.010
University of Dundee
Assay Description
An SPR assay was used to determine the binding affinities of compounds. Experiments were performed on a Biacore 3000 (Biacore, Uppsala, Sweden) instr...
J Med Chem 52: 2531-42 (2009)
Article DOI: 10.1021/jm801475n
BindingDB Entry DOI: 10.7270/Q23B5XGB