BDBM319598 US10174007, Example 13::US10787438, Example 13::US10988463, Example 13
SMILES: COc1c(nc(nc1C(F)(F)F)N1C[C@@H](O)[C@@H]1C)N1C[C@H]2[C@H](CC(O)=O)[C@H]2C1
InChI Key: InChIKey=CDDUZNXDZXURAV-LADJIXMOSA-N
Data: 3 IC50
Activity Spreadsheet -- Enzyme Inhibition Constant Data from BindingDB
Found 3 hits for monomerid = 319598
Trg + Lig
Ki
nM
ΔG°
kcal/mole
IC50
nM
Kd
nM
EC50/IC50
nM
koff
s-1
kon
M-1s-1
pHTemp
°C
Ketohexokinase (KHK) Isoform C
(Homo sapiens (Human))
BDBM319598
(US10174007, Example 13 | US10787438, Example 13 | ...)
Show SMILES COc1c(nc(nc1C(F)(F)F)N1C[C@@H](O)[C@@H]1C)N1C[C@H]2[C@H](CC(O)=O)[C@H]2C1 |r|
Show InChI InChI=1S/C17H21F3N4O4/c1-7-11(25)6-24(7)16-21-14(17(18,19)20)13(28-2)15(22-16)23-4-9-8(3-12(26)27)10(9)5-23/h7-11,25H,3-6H2,1-2H3,(H,26,27)/t7-,8-,9-,10+,11+/m0/s1
US Patent
n/an/a 33.9n/an/an/an/an/an/a
Pfizer Inc.
US Patent
Assay Description
A 384-well format on a Corning 3653 assay plate is used, and monitored by UV-vis spectroscopy in continuous mode at rt. Compounds were prepared in DM...
US Patent US10174007 (2019)
BindingDB Entry DOI: 10.7270/Q20867DX
Ketohexokinase (KHK) Isoform C
(Homo sapiens (Human))
BDBM319598
(US10174007, Example 13 | US10787438, Example 13 | ...)
Show SMILES COc1c(nc(nc1C(F)(F)F)N1C[C@@H](O)[C@@H]1C)N1C[C@H]2[C@H](CC(O)=O)[C@H]2C1 |r|
Show InChI InChI=1S/C17H21F3N4O4/c1-7-11(25)6-24(7)16-21-14(17(18,19)20)13(28-2)15(22-16)23-4-9-8(3-12(26)27)10(9)5-23/h7-11,25H,3-6H2,1-2H3,(H,26,27)/t7-,8-,9-,10+,11+/m0/s1
US Patent
n/an/a 33.9n/an/an/an/an/an/a
Pfizer Inc.
US Patent
Assay Description
Assay A, a 384-well format on a Corning 3653 assay plate is used, and monitored by UV-vis spectroscopy in continuous mode at rt. Compounds were prepa...
US Patent US10988463 (2021)
Ketohexokinase (KHK) Isoform C
(Homo sapiens (Human))
BDBM319598
(US10174007, Example 13 | US10787438, Example 13 | ...)
Show SMILES COc1c(nc(nc1C(F)(F)F)N1C[C@@H](O)[C@@H]1C)N1C[C@H]2[C@H](CC(O)=O)[C@H]2C1 |r|
Show InChI InChI=1S/C17H21F3N4O4/c1-7-11(25)6-24(7)16-21-14(17(18,19)20)13(28-2)15(22-16)23-4-9-8(3-12(26)27)10(9)5-23/h7-11,25H,3-6H2,1-2H3,(H,26,27)/t7-,8-,9-,10+,11+/m0/s1
US Patent
n/an/a 33.9n/an/an/an/an/an/a
Pfizer Inc.
US Patent
Assay Description
Assay A, a 384-well format on a Corning 3653 assay plate is used, and monitored by UV-vis spectroscopy in continuous mode at rt. Compounds were prepa...
US Patent US10787438 (2020)