BDBM319663 4-[5-(trifluoromethyl)-1H-1,2,3-triazol-4-yl]-2- {1-[2-(2,4,6-trifluorophenyl)ethyl]-1H-imidazol- 4-yl}pyridine::US10174003, Example 82::US9896436, Example 82
SMILES: Fc1cc(F)c(CCn2cnc(c2)-c2cc(ccn2)-c2nn[nH]c2C(F)(F)F)c(F)c1
InChI Key: InChIKey=HUYPSMCWEAVAHQ-UHFFFAOYSA-N
Data: 8 IC50
Activity Spreadsheet -- Enzyme Inhibition Constant Data from BindingDB
Found 8 hits for monomerid = 319663
Trg + Lig
Ki
nM
ΔG°
kcal/mole
IC50
nM
Kd
nM
EC50/IC50
nM
koff
s-1
kon
M-1s-1
pHTemp
°C
Lysine-specific demethylase 2B
(Homo sapiens (Human))
BDBM319663
(4-[5-(trifluoromethyl)-1H-1,2,3-triazol-4-yl]-2- {...)
Show SMILES Fc1cc(F)c(CCn2cnc(c2)-c2cc(ccn2)-c2nn[nH]c2C(F)(F)F)c(F)c1
Show InChI InChI=1S/C19H12F6N6/c20-11-6-13(21)12(14(22)7-11)2-4-31-8-16(27-9-31)15-5-10(1-3-26-15)17-18(19(23,24)25)29-30-28-17/h1,3,5-9H,2,4H2,(H,28,29,30)
US Patent
n/an/a<100n/an/an/an/an/an/a
Celgene Quanticel Research, Inc.
US Patent
Assay Description
The ability of test compounds to inhibit the activity of FBXL10 was determined in 384-well plate format under the following reaction conditions: 0.3 ...
US Patent US10174003 (2019)
BindingDB Entry DOI: 10.7270/Q2417053
Lysine-specific demethylase 5B
(Homo sapiens (Human))
BDBM319663
(4-[5-(trifluoromethyl)-1H-1,2,3-triazol-4-yl]-2- {...)
Show SMILES Fc1cc(F)c(CCn2cnc(c2)-c2cc(ccn2)-c2nn[nH]c2C(F)(F)F)c(F)c1
Show InChI InChI=1S/C19H12F6N6/c20-11-6-13(21)12(14(22)7-11)2-4-31-8-16(27-9-31)15-5-10(1-3-26-15)17-18(19(23,24)25)29-30-28-17/h1,3,5-9H,2,4H2,(H,28,29,30)
US Patent
n/an/a 550n/an/an/an/an/an/a
Celgene Quanticel Research, Inc.
US Patent
Assay Description
The ability of test compounds to inhibit the activity of Jarid1B was determined in 384-well plate format under the following reaction conditions: 0.8...
US Patent US10174003 (2019)
BindingDB Entry DOI: 10.7270/Q2417053
Lysine-specific demethylase 4C
(Homo sapiens (Human))
BDBM319663
(4-[5-(trifluoromethyl)-1H-1,2,3-triazol-4-yl]-2- {...)
Show SMILES Fc1cc(F)c(CCn2cnc(c2)-c2cc(ccn2)-c2nn[nH]c2C(F)(F)F)c(F)c1
Show InChI InChI=1S/C19H12F6N6/c20-11-6-13(21)12(14(22)7-11)2-4-31-8-16(27-9-31)15-5-10(1-3-26-15)17-18(19(23,24)25)29-30-28-17/h1,3,5-9H,2,4H2,(H,28,29,30)
US Patent
n/an/a>1.00E+4n/an/an/an/an/an/a
Celgene Quanticel Research, Inc.
US Patent
Assay Description
The ability of test compounds to inhibit the activity of JMJD2C was determined in 384-well plate format under the following reaction conditions: 0.3 ...
US Patent US10174003 (2019)
BindingDB Entry DOI: 10.7270/Q2417053
Lysine-specific demethylase 6B
(Homo sapiens (Human))
BDBM319663
(4-[5-(trifluoromethyl)-1H-1,2,3-triazol-4-yl]-2- {...)
Show SMILES Fc1cc(F)c(CCn2cnc(c2)-c2cc(ccn2)-c2nn[nH]c2C(F)(F)F)c(F)c1
Show InChI InChI=1S/C19H12F6N6/c20-11-6-13(21)12(14(22)7-11)2-4-31-8-16(27-9-31)15-5-10(1-3-26-15)17-18(19(23,24)25)29-30-28-17/h1,3,5-9H,2,4H2,(H,28,29,30)
US Patent
n/an/a>1.00E+4n/an/an/an/an/an/a
GSK
Assay Description
The ability of test compounds to inhibit the activity of JMJD3 was determined in 384-well plate format under the following reaction conditions: 1 nM ...
Bioorg Med Chem Lett 17: 1584-9 (2007)
BindingDB Entry DOI: 10.7270/Q2FT8PBQ
Lysine-specific demethylase 2B
(Homo sapiens (Human))
BDBM319663
(4-[5-(trifluoromethyl)-1H-1,2,3-triazol-4-yl]-2- {...)
Show SMILES Fc1cc(F)c(CCn2cnc(c2)-c2cc(ccn2)-c2nn[nH]c2C(F)(F)F)c(F)c1
Show InChI InChI=1S/C19H12F6N6/c20-11-6-13(21)12(14(22)7-11)2-4-31-8-16(27-9-31)15-5-10(1-3-26-15)17-18(19(23,24)25)29-30-28-17/h1,3,5-9H,2,4H2,(H,28,29,30)
US Patent
n/an/a<100n/an/an/an/an/an/a
GSK
Assay Description
The ability of test compounds to inhibit the activity of FBXL10 was determined in 384-well plate format under the following reaction conditions: 0.3 ...
Bioorg Med Chem Lett 17: 1584-9 (2007)
BindingDB Entry DOI: 10.7270/Q2FT8PBQ
Lysine-specific demethylase 5B
(Homo sapiens (Human))
BDBM319663
(4-[5-(trifluoromethyl)-1H-1,2,3-triazol-4-yl]-2- {...)
Show SMILES Fc1cc(F)c(CCn2cnc(c2)-c2cc(ccn2)-c2nn[nH]c2C(F)(F)F)c(F)c1
Show InChI InChI=1S/C19H12F6N6/c20-11-6-13(21)12(14(22)7-11)2-4-31-8-16(27-9-31)15-5-10(1-3-26-15)17-18(19(23,24)25)29-30-28-17/h1,3,5-9H,2,4H2,(H,28,29,30)
US Patent
n/an/a 300n/an/an/an/an/an/a
GSK
Assay Description
The ability of test compounds to inhibit the activity of Jarid1B was determined in 384-well plate format under the following reaction conditions: 0.8...
Bioorg Med Chem Lett 17: 1584-9 (2007)
BindingDB Entry DOI: 10.7270/Q2FT8PBQ
Lysine-specific demethylase 4C
(Homo sapiens (Human))
BDBM319663
(4-[5-(trifluoromethyl)-1H-1,2,3-triazol-4-yl]-2- {...)
Show SMILES Fc1cc(F)c(CCn2cnc(c2)-c2cc(ccn2)-c2nn[nH]c2C(F)(F)F)c(F)c1
Show InChI InChI=1S/C19H12F6N6/c20-11-6-13(21)12(14(22)7-11)2-4-31-8-16(27-9-31)15-5-10(1-3-26-15)17-18(19(23,24)25)29-30-28-17/h1,3,5-9H,2,4H2,(H,28,29,30)
US Patent
n/an/a>1.00E+4n/an/an/an/an/an/a
GSK
Assay Description
The ability of test compounds to inhibit the activity of JMJD2C was determined in 384-well plate format under the following reaction conditions: 0.3 ...
Bioorg Med Chem Lett 17: 1584-9 (2007)
BindingDB Entry DOI: 10.7270/Q2FT8PBQ
Lysine-specific demethylase 6B
(Homo sapiens (Human))
BDBM319663
(4-[5-(trifluoromethyl)-1H-1,2,3-triazol-4-yl]-2- {...)
Show SMILES Fc1cc(F)c(CCn2cnc(c2)-c2cc(ccn2)-c2nn[nH]c2C(F)(F)F)c(F)c1
Show InChI InChI=1S/C19H12F6N6/c20-11-6-13(21)12(14(22)7-11)2-4-31-8-16(27-9-31)15-5-10(1-3-26-15)17-18(19(23,24)25)29-30-28-17/h1,3,5-9H,2,4H2,(H,28,29,30)
US Patent
n/an/a>1.00E+4n/an/an/an/an/an/a
Celgene Quanticel Research, Inc.
US Patent
Assay Description
The ability of test compounds to inhibit the activity of JMJD3 was determined in 384-well plate format under the following reaction conditions: 1 nM ...
US Patent US10174003 (2019)
BindingDB Entry DOI: 10.7270/Q2417053