BDBM31978 Dipeptidyl nitrile inhibitor, 11
SMILES: Cc1ccc(C)c(c1)C(=O)N[C@@H](Cc1cccc(Cl)c1)C(=O)NCC#N
InChI Key: InChIKey=JAFKJSUWVDTZSI-SFHVURJKSA-N
Data: 5 IC50
Activity Spreadsheet -- Enzyme Inhibition Constant Data from BindingDB
Found 5 hits for monomerid = 31978
Trg + Lig
Ki
nM
ΔG°
kcal/mole
IC50
nM
Kd
nM
EC50/IC50
nM
koff
s-1
kon
M-1s-1
pHTemp
°C
Cathepsin L
(Homo sapiens (Human))
BDBM31978
(Dipeptidyl nitrile inhibitor, 11)
Show SMILES Cc1ccc(C)c(c1)C(=O)N[C@@H](Cc1cccc(Cl)c1)C(=O)NCC#N |r|
Show InChI InChI=1S/C20H20ClN3O2/c1-13-6-7-14(2)17(10-13)19(25)24-18(20(26)23-9-8-22)12-15-4-3-5-16(21)11-15/h3-7,10-11,18H,9,12H2,1-2H3,(H,23,26)(H,24,25)/t18-/m0/s1
n/an/a 79n/an/an/an/a7.037
AstraZeneca
Assay Description
IC50 values for inhibition of Cathepsins were determined from dose dependent inhibition of cleavage of fluorogenic, AMC-tagged, peptide substrates.
Bioorg Med Chem Lett 19: 4280-3 (2009)
Article DOI: 10.1016/j.bmcl.2009.05.071
BindingDB Entry DOI: 10.7270/Q2TT4PBM
Cathepsin L2
(Homo sapiens (Human))
BDBM31978
(Dipeptidyl nitrile inhibitor, 11)
Show SMILES Cc1ccc(C)c(c1)C(=O)N[C@@H](Cc1cccc(Cl)c1)C(=O)NCC#N |r|
Show InChI InChI=1S/C20H20ClN3O2/c1-13-6-7-14(2)17(10-13)19(25)24-18(20(26)23-9-8-22)12-15-4-3-5-16(21)11-15/h3-7,10-11,18H,9,12H2,1-2H3,(H,23,26)(H,24,25)/t18-/m0/s1
n/an/a 1.59E+3n/an/an/an/an/an/a
AstraZeneca
Assay Description
IC50 values for inhibition of Cathepsins were determined from dose dependent inhibition of cleavage of fluorogenic, AMC-tagged, peptide substrates.
Bioorg Med Chem Lett 19: 4280-3 (2009)
Article DOI: 10.1016/j.bmcl.2009.05.071
BindingDB Entry DOI: 10.7270/Q2TT4PBM
Cathepsin B
(Homo sapiens (Human))
BDBM31978
(Dipeptidyl nitrile inhibitor, 11)
Show SMILES Cc1ccc(C)c(c1)C(=O)N[C@@H](Cc1cccc(Cl)c1)C(=O)NCC#N |r|
Show InChI InChI=1S/C20H20ClN3O2/c1-13-6-7-14(2)17(10-13)19(25)24-18(20(26)23-9-8-22)12-15-4-3-5-16(21)11-15/h3-7,10-11,18H,9,12H2,1-2H3,(H,23,26)(H,24,25)/t18-/m0/s1
Reactome pathway
n/an/a 5.01E+3n/an/an/an/an/an/a
AstraZeneca
Assay Description
IC50 values for inhibition of Cathepsins were determined from dose dependent inhibition of cleavage of fluorogenic, AMC-tagged, peptide substrates.
Bioorg Med Chem Lett 19: 4280-3 (2009)
Article DOI: 10.1016/j.bmcl.2009.05.071
BindingDB Entry DOI: 10.7270/Q2TT4PBM
Cathepsin K
(Homo sapiens (Human))
BDBM31978
(Dipeptidyl nitrile inhibitor, 11)
Show SMILES Cc1ccc(C)c(c1)C(=O)N[C@@H](Cc1cccc(Cl)c1)C(=O)NCC#N |r|
Show InChI InChI=1S/C20H20ClN3O2/c1-13-6-7-14(2)17(10-13)19(25)24-18(20(26)23-9-8-22)12-15-4-3-5-16(21)11-15/h3-7,10-11,18H,9,12H2,1-2H3,(H,23,26)(H,24,25)/t18-/m0/s1
Reactome pathway
n/an/a 6.31E+3n/an/an/an/an/an/a
AstraZeneca
Assay Description
IC50 values for inhibition of Cathepsins were determined from dose dependent inhibition of cleavage of fluorogenic, AMC-tagged, peptide substrates.
Bioorg Med Chem Lett 19: 4280-3 (2009)
Article DOI: 10.1016/j.bmcl.2009.05.071
BindingDB Entry DOI: 10.7270/Q2TT4PBM
Cathepsin S
(Homo sapiens (Human))
BDBM31978
(Dipeptidyl nitrile inhibitor, 11)
Show SMILES Cc1ccc(C)c(c1)C(=O)N[C@@H](Cc1cccc(Cl)c1)C(=O)NCC#N |r|
Show InChI InChI=1S/C20H20ClN3O2/c1-13-6-7-14(2)17(10-13)19(25)24-18(20(26)23-9-8-22)12-15-4-3-5-16(21)11-15/h3-7,10-11,18H,9,12H2,1-2H3,(H,23,26)(H,24,25)/t18-/m0/s1
Reactome pathway
n/an/a 1.26E+3n/an/an/an/an/an/a
AstraZeneca
Assay Description
IC50 values for inhibition of Cathepsins were determined from dose dependent inhibition of cleavage of fluorogenic, AMC-tagged, peptide substrates.
Bioorg Med Chem Lett 19: 4280-3 (2009)
Article DOI: 10.1016/j.bmcl.2009.05.071
BindingDB Entry DOI: 10.7270/Q2TT4PBM