BDBM320063 3-[(−3-hydroxybutan-2-yl)oxy]-5-(5-methyl-1,3-thiazol-2-yl)-N-{(1R)-1-[6-(trifluoromethyl)pyridazin-3-yl]ethyl}benzamide::US10174016, Example 230
SMILES: CC(O)[C@H](C)Oc1cc(cc(c1)-c1ncc(C)s1)C(=O)N[C@H](C)c1ccc(nn1)C(F)(F)F
InChI Key: InChIKey=LMHZXBDHIYABCN-YIOYIWSBSA-N
Data: 2 IC50
Activity Spreadsheet -- Enzyme Inhibition Constant Data from BindingDB
Found 2 hits for monomerid = 320063
Trg + Lig
Ki
nM
ΔG°
kcal/mole
IC50
nM
Kd
nM
EC50/IC50
nM
koff
s-1
kon
M-1s-1
pHTemp
°C
P2X purinoceptor 2
(Homo sapiens (Human))
BDBM320063
(3-[(−3-hydroxybutan-2-yl)oxy]-5-(5-methyl-1,...)
Show SMILES CC(O)[C@H](C)Oc1cc(cc(c1)-c1ncc(C)s1)C(=O)N[C@H](C)c1ccc(nn1)C(F)(F)F |r|
Show InChI InChI=1S/C22H23F3N4O3S/c1-11-10-26-21(33-11)16-7-15(8-17(9-16)32-14(4)13(3)30)20(31)27-12(2)18-5-6-19(29-28-18)22(23,24)25/h5-10,12-14,30H,1-4H3,(H,27,31)/t12-,13?,14+/m1/s1
US Patent
n/an/a 209n/an/an/an/an/an/a
BEYER AKTIENGESELLSCHAFT
US Patent
Assay Description
A fluorescent imaging plate reader (FLEX/FLIPR station; Molecular Devices) was used to monitor intracellular calcium levels using the calcium-chelati...
US Patent US10174016 (2019)
BindingDB Entry DOI: 10.7270/Q2GB264F
P2X purinoceptor 3
(Homo sapiens (Human))
BDBM320063
(3-[(−3-hydroxybutan-2-yl)oxy]-5-(5-methyl-1,...)
Show SMILES CC(O)[C@H](C)Oc1cc(cc(c1)-c1ncc(C)s1)C(=O)N[C@H](C)c1ccc(nn1)C(F)(F)F |r|
Show InChI InChI=1S/C22H23F3N4O3S/c1-11-10-26-21(33-11)16-7-15(8-17(9-16)32-14(4)13(3)30)20(31)27-12(2)18-5-6-19(29-28-18)22(23,24)25/h5-10,12-14,30H,1-4H3,(H,27,31)/t12-,13?,14+/m1/s1
US Patent
n/an/a 2n/an/an/an/an/an/a
BEYER AKTIENGESELLSCHAFT
US Patent
Assay Description
A fluorescent imaging plate reader (FLEX/FLIPR station; Molecular Devices) was used to monitor intracellular calcium levels using the calcium-chelati...
US Patent US10174016 (2019)
BindingDB Entry DOI: 10.7270/Q2GB264F