BDBM320172 3-[(3-hydroxybutan-2-yl)oxy]-5-(5-methyl-1,3-thiazol-2-yl)-N-{(1R)-1-[2-(trifluoromethyl)pyrimidin-5-yl]ethyl}benzamide::US10174016, Example 339::US10472354, Example 339
SMILES: CC(O)[C@H](C)Oc1cc(cc(c1)-c1ncc(C)s1)C(=O)N[C@H](C)c1cnc(nc1)C(F)(F)F
InChI Key: InChIKey=FSGDRFBLPAILDE-YIOYIWSBSA-N
Data: 6 IC50
Activity Spreadsheet -- Enzyme Inhibition Constant Data from BindingDB
Found 6 hits for monomerid = 320172
Trg + Lig
Ki
nM
ΔG°
kcal/mole
IC50
nM
Kd
nM
EC50/IC50
nM
koff
s-1
kon
M-1s-1
pHTemp
°C
P2X purinoceptor 3
(Homo sapiens (Human))
BDBM320172
(3-[(3-hydroxybutan-2-yl)oxy]-5-(5-methyl-1,3-thiaz...)
Show SMILES CC(O)[C@H](C)Oc1cc(cc(c1)-c1ncc(C)s1)C(=O)N[C@H](C)c1cnc(nc1)C(F)(F)F
Show InChI InChI=1S/C22H23F3N4O3S/c1-11-8-26-20(33-11)16-5-15(6-18(7-16)32-14(4)13(3)30)19(31)29-12(2)17-9-27-21(28-10-17)22(23,24)25/h5-10,12-14,30H,1-4H3,(H,29,31)/t12-,13?,14+/m1/s1
US Patent
n/an/a 5n/an/an/an/an/an/a
Bayer Aktiengesellschaft
US Patent
Assay Description
A fluorescent imaging plate reader (FLEX/FLIPR station; Molecular Devices) was used to monitor intracellular calcium levels using the calcium-chelati...
US Patent US10183937 (2019)
BindingDB Entry DOI: 10.7270/Q2028TNS
P2X purinoceptor 2
(Homo sapiens (Human))
BDBM320172
(3-[(3-hydroxybutan-2-yl)oxy]-5-(5-methyl-1,3-thiaz...)
Show SMILES CC(O)[C@H](C)Oc1cc(cc(c1)-c1ncc(C)s1)C(=O)N[C@H](C)c1cnc(nc1)C(F)(F)F
Show InChI InChI=1S/C22H23F3N4O3S/c1-11-8-26-20(33-11)16-5-15(6-18(7-16)32-14(4)13(3)30)19(31)29-12(2)17-9-27-21(28-10-17)22(23,24)25/h5-10,12-14,30H,1-4H3,(H,29,31)/t12-,13?,14+/m1/s1
US Patent
n/an/a 74n/an/an/an/an/an/a
Bayer Aktiengesellschaft
US Patent
Assay Description
A fluorescent imaging plate reader (FLEX/FLIPR station; Molecular Devices) was used to monitor intracellular calcium levels using the calcium-chelati...
US Patent US10183937 (2019)
BindingDB Entry DOI: 10.7270/Q2028TNS
P2X2/3
(Homo sapiens (Human))
BDBM320172
(3-[(3-hydroxybutan-2-yl)oxy]-5-(5-methyl-1,3-thiaz...)
Show SMILES CC(O)[C@H](C)Oc1cc(cc(c1)-c1ncc(C)s1)C(=O)N[C@H](C)c1cnc(nc1)C(F)(F)F
Show InChI InChI=1S/C22H23F3N4O3S/c1-11-8-26-20(33-11)16-5-15(6-18(7-16)32-14(4)13(3)30)19(31)29-12(2)17-9-27-21(28-10-17)22(23,24)25/h5-10,12-14,30H,1-4H3,(H,29,31)/t12-,13?,14+/m1/s1
NCI pathway
Reactome pathway
US Patent
n/an/a 251n/an/an/an/an/an/a
Bayer Aktiengesellschaft
US Patent
Assay Description
A fluorescent imaging plate reader (FILEX/FLIPR station; Molecular Devices) was used to monitor intracellular calcium levels using the calcium-chelat...
US Patent US10472354 (2019)
BindingDB Entry DOI: 10.7270/Q2KD2197
P2X purinoceptor 2
(Homo sapiens (Human))
BDBM320172
(3-[(3-hydroxybutan-2-yl)oxy]-5-(5-methyl-1,3-thiaz...)
Show SMILES CC(O)[C@H](C)Oc1cc(cc(c1)-c1ncc(C)s1)C(=O)N[C@H](C)c1cnc(nc1)C(F)(F)F
Show InChI InChI=1S/C22H23F3N4O3S/c1-11-8-26-20(33-11)16-5-15(6-18(7-16)32-14(4)13(3)30)19(31)29-12(2)17-9-27-21(28-10-17)22(23,24)25/h5-10,12-14,30H,1-4H3,(H,29,31)/t12-,13?,14+/m1/s1
US Patent
n/an/a 251n/an/an/an/an/an/a
BEYER AKTIENGESELLSCHAFT
US Patent
Assay Description
A fluorescent imaging plate reader (FLEX/FLIPR station; Molecular Devices) was used to monitor intracellular calcium levels using the calcium-chelati...
US Patent US10174016 (2019)
BindingDB Entry DOI: 10.7270/Q2GB264F
P2X purinoceptor 3
(Homo sapiens (Human))
BDBM320172
(3-[(3-hydroxybutan-2-yl)oxy]-5-(5-methyl-1,3-thiaz...)
Show SMILES CC(O)[C@H](C)Oc1cc(cc(c1)-c1ncc(C)s1)C(=O)N[C@H](C)c1cnc(nc1)C(F)(F)F
Show InChI InChI=1S/C22H23F3N4O3S/c1-11-8-26-20(33-11)16-5-15(6-18(7-16)32-14(4)13(3)30)19(31)29-12(2)17-9-27-21(28-10-17)22(23,24)25/h5-10,12-14,30H,1-4H3,(H,29,31)/t12-,13?,14+/m1/s1
US Patent
n/an/a 5n/an/an/an/an/an/a
Bayer Aktiengesellschaft
US Patent
Assay Description
A fluorescent imaging plate reader (FILEX/FLIPR station; Molecular Devices) was used to monitor intracellular calcium levels using the calcium-chelat...
US Patent US10472354 (2019)
BindingDB Entry DOI: 10.7270/Q2KD2197
P2X purinoceptor 3
(Homo sapiens (Human))
BDBM320172
(3-[(3-hydroxybutan-2-yl)oxy]-5-(5-methyl-1,3-thiaz...)
Show SMILES CC(O)[C@H](C)Oc1cc(cc(c1)-c1ncc(C)s1)C(=O)N[C@H](C)c1cnc(nc1)C(F)(F)F
Show InChI InChI=1S/C22H23F3N4O3S/c1-11-8-26-20(33-11)16-5-15(6-18(7-16)32-14(4)13(3)30)19(31)29-12(2)17-9-27-21(28-10-17)22(23,24)25/h5-10,12-14,30H,1-4H3,(H,29,31)/t12-,13?,14+/m1/s1
US Patent
n/an/a 5n/an/an/an/an/an/a
BEYER AKTIENGESELLSCHAFT
US Patent
Assay Description
A fluorescent imaging plate reader (FLEX/FLIPR station; Molecular Devices) was used to monitor intracellular calcium levels using the calcium-chelati...
US Patent US10174016 (2019)
BindingDB Entry DOI: 10.7270/Q2GB264F