BDBM320217 3-{[4,4-difluoro-1-methylpiperidin-3-yl]methoxy}-5-(5-methyl-1,3-thiazol-2-yl)-N-{(1R)-1-[2-(trifluoromethyl)pyrimidin-5-yl]ethyl}benzamide::US10174016, Example 384::US10174016, Example 385::US10472354, Example 385
SMILES: C[C@@H](NC(=O)c1cc(OC[C@@H]2CN(C)CCC2(F)F)cc(c1)-c1ncc(C)s1)c1cnc(nc1)C(F)(F)F
InChI Key: InChIKey=LGPVNMAGAZJDEW-BEFAXECRSA-N
Data: 6 IC50
Activity Spreadsheet -- Enzyme Inhibition Constant Data from BindingDB
Found 6 hits for monomerid = 320217
Trg + Lig
Ki
nM
ΔG°
kcal/mole
IC50
nM
Kd
nM
EC50/IC50
nM
koff
s-1
kon
M-1s-1
pHTemp
°C
P2X purinoceptor 3
(Homo sapiens (Human))
BDBM320217
(3-{[4,4-difluoro-1-methylpiperidin-3-yl]methoxy}-5...)
Show SMILES C[C@@H](NC(=O)c1cc(OC[C@@H]2CN(C)CCC2(F)F)cc(c1)-c1ncc(C)s1)c1cnc(nc1)C(F)(F)F
Show InChI InChI=1S/C25H26F5N5O2S/c1-14-9-31-22(38-14)17-6-16(7-20(8-17)37-13-19-12-35(3)5-4-24(19,26)27)21(36)34-15(2)18-10-32-23(33-11-18)25(28,29)30/h6-11,15,19H,4-5,12-13H2,1-3H3,(H,34,36)/t15-,19+/m1/s1
US Patent
n/an/a 3n/an/an/an/an/an/a
BEYER AKTIENGESELLSCHAFT
US Patent
Assay Description
A fluorescent imaging plate reader (FLEX/FLIPR station; Molecular Devices) was used to monitor intracellular calcium levels using the calcium-chelati...
US Patent US10174016 (2019)
BindingDB Entry DOI: 10.7270/Q2GB264F
P2X purinoceptor 2
(Homo sapiens (Human))
BDBM320217
(3-{[4,4-difluoro-1-methylpiperidin-3-yl]methoxy}-5...)
Show SMILES C[C@@H](NC(=O)c1cc(OC[C@@H]2CN(C)CCC2(F)F)cc(c1)-c1ncc(C)s1)c1cnc(nc1)C(F)(F)F
Show InChI InChI=1S/C25H26F5N5O2S/c1-14-9-31-22(38-14)17-6-16(7-20(8-17)37-13-19-12-35(3)5-4-24(19,26)27)21(36)34-15(2)18-10-32-23(33-11-18)25(28,29)30/h6-11,15,19H,4-5,12-13H2,1-3H3,(H,34,36)/t15-,19+/m1/s1
US Patent
n/an/a 75n/an/an/an/an/an/a
BEYER AKTIENGESELLSCHAFT
US Patent
Assay Description
A fluorescent imaging plate reader (FLEX/FLIPR station; Molecular Devices) was used to monitor intracellular calcium levels using the calcium-chelati...
US Patent US10174016 (2019)
BindingDB Entry DOI: 10.7270/Q2GB264F
P2X2/3
(Homo sapiens (Human))
BDBM320217
(3-{[4,4-difluoro-1-methylpiperidin-3-yl]methoxy}-5...)
Show SMILES C[C@@H](NC(=O)c1cc(OC[C@@H]2CN(C)CCC2(F)F)cc(c1)-c1ncc(C)s1)c1cnc(nc1)C(F)(F)F
Show InChI InChI=1S/C25H26F5N5O2S/c1-14-9-31-22(38-14)17-6-16(7-20(8-17)37-13-19-12-35(3)5-4-24(19,26)27)21(36)34-15(2)18-10-32-23(33-11-18)25(28,29)30/h6-11,15,19H,4-5,12-13H2,1-3H3,(H,34,36)/t15-,19+/m1/s1
NCI pathway
Reactome pathway
US Patent
n/an/a 28n/an/an/an/an/an/a
Bayer Aktiengesellschaft
US Patent
Assay Description
A fluorescent imaging plate reader (FILEX/FLIPR station; Molecular Devices) was used to monitor intracellular calcium levels using the calcium-chelat...
US Patent US10472354 (2019)
BindingDB Entry DOI: 10.7270/Q2KD2197
P2X purinoceptor 2
(Homo sapiens (Human))
BDBM320217
(3-{[4,4-difluoro-1-methylpiperidin-3-yl]methoxy}-5...)
Show SMILES C[C@@H](NC(=O)c1cc(OC[C@@H]2CN(C)CCC2(F)F)cc(c1)-c1ncc(C)s1)c1cnc(nc1)C(F)(F)F
Show InChI InChI=1S/C25H26F5N5O2S/c1-14-9-31-22(38-14)17-6-16(7-20(8-17)37-13-19-12-35(3)5-4-24(19,26)27)21(36)34-15(2)18-10-32-23(33-11-18)25(28,29)30/h6-11,15,19H,4-5,12-13H2,1-3H3,(H,34,36)/t15-,19+/m1/s1
US Patent
n/an/a 28n/an/an/an/an/an/a
BEYER AKTIENGESELLSCHAFT
US Patent
Assay Description
A fluorescent imaging plate reader (FLEX/FLIPR station; Molecular Devices) was used to monitor intracellular calcium levels using the calcium-chelati...
US Patent US10174016 (2019)
BindingDB Entry DOI: 10.7270/Q2GB264F
P2X purinoceptor 3
(Homo sapiens (Human))
BDBM320217
(3-{[4,4-difluoro-1-methylpiperidin-3-yl]methoxy}-5...)
Show SMILES C[C@@H](NC(=O)c1cc(OC[C@@H]2CN(C)CCC2(F)F)cc(c1)-c1ncc(C)s1)c1cnc(nc1)C(F)(F)F
Show InChI InChI=1S/C25H26F5N5O2S/c1-14-9-31-22(38-14)17-6-16(7-20(8-17)37-13-19-12-35(3)5-4-24(19,26)27)21(36)34-15(2)18-10-32-23(33-11-18)25(28,29)30/h6-11,15,19H,4-5,12-13H2,1-3H3,(H,34,36)/t15-,19+/m1/s1
US Patent
n/an/a 3n/an/an/an/an/an/a
Bayer Aktiengesellschaft
US Patent
Assay Description
A fluorescent imaging plate reader (FILEX/FLIPR station; Molecular Devices) was used to monitor intracellular calcium levels using the calcium-chelat...
US Patent US10472354 (2019)
BindingDB Entry DOI: 10.7270/Q2KD2197
P2X purinoceptor 3
(Homo sapiens (Human))
BDBM320217
(3-{[4,4-difluoro-1-methylpiperidin-3-yl]methoxy}-5...)
Show SMILES C[C@@H](NC(=O)c1cc(OC[C@@H]2CN(C)CCC2(F)F)cc(c1)-c1ncc(C)s1)c1cnc(nc1)C(F)(F)F
Show InChI InChI=1S/C25H26F5N5O2S/c1-14-9-31-22(38-14)17-6-16(7-20(8-17)37-13-19-12-35(3)5-4-24(19,26)27)21(36)34-15(2)18-10-32-23(33-11-18)25(28,29)30/h6-11,15,19H,4-5,12-13H2,1-3H3,(H,34,36)/t15-,19+/m1/s1
US Patent
n/an/a 3n/an/an/an/an/an/a
BEYER AKTIENGESELLSCHAFT
US Patent
Assay Description
A fluorescent imaging plate reader (FLEX/FLIPR station; Molecular Devices) was used to monitor intracellular calcium levels using the calcium-chelati...
US Patent US10174016 (2019)
BindingDB Entry DOI: 10.7270/Q2GB264F