BDBM321961 (E)-tert-Butyl-4-(3-(2-((5-methyl-2H-tetrazol-2-yl)methyl)-4-(trifluoromethyl) phenyl)acryloyl)piperazine-1-carboxylate::US10183025, Example 68::US9763957, Example 68
SMILES: Cc1nnn(Cc2cc(ccc2\C=C\C(=O)N2CCN(CC2)C(=O)OC(C)(C)C)C(F)(F)F)n1
InChI Key: InChIKey=GLDXKLUXMGFURA-SOFGYWHQSA-N
Data: 2 IC50
Activity Spreadsheet -- Enzyme Inhibition Constant Data from BindingDB
Found 2 hits for monomerid = 321961
Trg + Lig
Ki
nM
ΔG°
kcal/mole
IC50
nM
Kd
nM
EC50/IC50
nM
koff
s-1
kon
M-1s-1
pHTemp
°C
Ataxin-1
(Homo sapiens (Human))
BDBM321961
((E)-tert-Butyl-4-(3-(2-((5-methyl-2H-tetrazol-2-yl...)
Show SMILES Cc1nnn(Cc2cc(ccc2\C=C\C(=O)N2CCN(CC2)C(=O)OC(C)(C)C)C(F)(F)F)n1
Show InChI InChI=1S/C22H27F3N6O3/c1-15-26-28-31(27-15)14-17-13-18(22(23,24)25)7-5-16(17)6-8-19(32)29-9-11-30(12-10-29)20(33)34-21(2,3)4/h5-8,13H,9-12,14H2,1-4H3/b8-6+
US Patent
n/an/a 4.5n/an/an/an/an/an/a
Novartis AG
US Patent
Assay Description
Method All experimental measurements were performed in black 384 well polystyrene (low volume, round bottom, Corning (3676)) plates. PerkinElmer EnVi...
US Patent US9763957 (2017)
BindingDB Entry DOI: 10.7270/Q2QF8W0D
Ectonucleotide pyrophosphatase/phosphodiesterase family member 2
(Homo sapiens (Human))
BDBM321961
((E)-tert-Butyl-4-(3-(2-((5-methyl-2H-tetrazol-2-yl...)
Show SMILES Cc1nnn(Cc2cc(ccc2\C=C\C(=O)N2CCN(CC2)C(=O)OC(C)(C)C)C(F)(F)F)n1
Show InChI InChI=1S/C22H27F3N6O3/c1-15-26-28-31(27-15)14-17-13-18(22(23,24)25)7-5-16(17)6-8-19(32)29-9-11-30(12-10-29)20(33)34-21(2,3)4/h5-8,13H,9-12,14H2,1-4H3/b8-6+
US Patent
n/an/a 4.5n/an/an/an/an/an/a
Novartis AG
US Patent
Assay Description
Reagents LPC (oleoyl (18:1)) was purchased from Avanti Polar Lipids (Alabaster, Ala.) and solubilized in methanol to 20 mM. Amplex Red was obtained f...
US Patent US10183025 (2019)
BindingDB Entry DOI: 10.7270/Q2RN39XZ