BDBM322527 5-[3-(4-tert-butyl-1H-imidazol-2-yl)chroman-6-yl]oxy-3,4-dihydro-1H-1,8-naphthyridin-2-one::US10183939, Example 5
SMILES: CC(C)(C)c1c[nH]c(n1)C1COc2ccc(Oc3ccnc4NC(=O)CCc34)cc2C1
InChI Key:
Data: 2 IC50
Activity Spreadsheet -- Enzyme Inhibition Constant Data from BindingDB
Found 2 hits for monomerid = 322527
Trg + Lig
Ki
nM
ΔG°
kcal/mole
IC50
nM
Kd
nM
EC50/IC50
nM
koff
s-1
kon
M-1s-1
pHTemp
°C
C-RAF (Y340D Y341D)
(Homo sapiens (Human))
BDBM322527
(5-[3-(4-tert-butyl-1H-imidazol-2-yl)chroman-6-yl]o...)
Show SMILES CC(C)(C)c1c[nH]c(n1)C1COc2ccc(Oc3ccnc4NC(=O)CCc34)cc2C1
US Patent
n/an/a<4n/an/an/an/an/an/a
Redx Pharma PLC
US Patent
US Patent US10183939 (2019)
BindingDB Entry DOI: 10.7270/Q2QN68WX
B-Raf (V600E)
(Homo sapiens (Human))
BDBM322527
(5-[3-(4-tert-butyl-1H-imidazol-2-yl)chroman-6-yl]o...)
Show SMILES CC(C)(C)c1c[nH]c(n1)C1COc2ccc(Oc3ccnc4NC(=O)CCc34)cc2C1
US Patent
n/an/a 52n/an/an/an/an/an/a
Redx Pharma PLC
US Patent
Assay Description
To determine whether compounds bind to RAF kinases, they are tested in a competition binding assay. The Invitrogen LanthaScreen Eu binding assay invo...
US Patent US10183939 (2019)
BindingDB Entry DOI: 10.7270/Q2QN68WX