BDBM322554 US10183940, Example 7
SMILES: CC(C)(NC(=O)c1cccc2CNCCOc12)c1cccc2ccccc12
InChI Key: InChIKey=QCJYDUUAQGUQSM-UHFFFAOYSA-N
Data: 1 EC50
Activity Spreadsheet -- Enzyme Inhibition Constant Data from BindingDB
Found 1 hit for monomerid = 322554
Trg + Lig
Ki
nM
ΔG°
kcal/mole
IC50
nM
Kd
nM
EC50/IC50
nM
koff
s-1
kon
M-1s-1
pHTemp
°C
Somatostatin receptor type 4
(Homo sapiens (Human))
BDBM322554
(US10183940, Example 7)
Show SMILES CC(C)(NC(=O)c1cccc2CNCCOc12)c1cccc2ccccc12
Show InChI InChI=1S/C23H24N2O2/c1-23(2,20-12-6-8-16-7-3-4-10-18(16)20)25-22(26)19-11-5-9-17-15-24-13-14-27-21(17)19/h3-12,24H,13-15H2,1-2H3,(H,25,26)
US Patent
n/an/an/an/a 1.40n/an/an/an/a
Boehringer Ingelheim International GmbH
US Patent
Assay Description
The activation of the SSTR4 receptor (Gi coupled) causes an inhibition of intracellular cAMP after stimulation with Forskolin, which can be quantifia...
US Patent US10183940 (2019)
BindingDB Entry DOI: 10.7270/Q2KW5J45