null
SMILES: CC(C)(NC(=O)c1cccc2CNCCOc12)c1n[nH]c2c(Cl)cccc12
InChI Key: InChIKey=RRSOQZKBFQGCKX-UHFFFAOYSA-N
Activity Spreadsheet -- Enzyme Inhibition Constant Data from BindingDB
Found 1 hit for monomerid = 322592
Trg + Lig
Ki
nM
ΔG°
kcal/mole
IC50
nM
Kd
nM
EC50/IC50
nM
koff
s-1
kon
M-1s-1
pHTemp
°C
Somatostatin receptor type 4
(Homo sapiens (Human))
BDBM322592
(US10183940, Example 44)
Show SMILES CC(C)(NC(=O)c1cccc2CNCCOc12)c1n[nH]c2c(Cl)cccc12
Show InChI InChI=1S/C20H21ClN4O2/c1-20(2,18-13-6-4-8-15(21)16(13)24-25-18)23-19(26)14-7-3-5-12-11-22-9-10-27-17(12)14/h3-8,22H,9-11H2,1-2H3,(H,23,26)(H,24,25)
US Patent
n/an/an/an/a 1.30n/an/an/an/a
Boehringer Ingelheim International GmbH
US Patent
Assay Description
The activation of the SSTR4 receptor (Gi coupled) causes an inhibition of intracellular cAMP after stimulation with Forskolin, which can be quantifia...
US Patent US10183940 (2019)
BindingDB Entry DOI: 10.7270/Q2KW5J45