BDBM323019 1-Methyl-4-[({(1R,2R)-2-[4-(3-methyl-1H- pyrazol-5- yl)benzoyl]cyclohexyl}carbonyl)amino]- 1H-pyrazole-3-carboxamide::US10183947, Example 4::US10508119, Example 4
SMILES: Cc1cc(n[nH]1)-c1ccc(cc1)C(=O)[C@@H]1CCCC[C@H]1C(=O)Nc1cn(C)nc1C(N)=O
InChI Key:
Data: 3 IC50
Activity Spreadsheet -- Enzyme Inhibition Constant Data from BindingDB
Found 3 hits for monomerid = 323019
Trg + Lig
Ki
nM
ΔG°
kcal/mole
IC50
nM
Kd
nM
EC50/IC50
nM
koff
s-1
kon
M-1s-1
pHTemp
°C
Arachidonate 5-lipoxygenase
(Homo sapiens (Human))
BDBM323019
(1-Methyl-4-[({(1R,2R)-2-[4-(3-methyl-1H- pyrazol-5...)
Show SMILES Cc1cc(n[nH]1)-c1ccc(cc1)C(=O)[C@@H]1CCCC[C@H]1C(=O)Nc1cn(C)nc1C(N)=O |r|
Reactome pathway
US Patent
n/an/a 36n/an/an/an/an/an/a
ASTRAZENECA AB
US Patent
Assay Description
Compounds were tested in a competition binding assay using 3H-MK591 as tracer. (Preparation of MK-591 is described in Bioorg. Med. Chem. Lett. 1999, ...
US Patent US10183947 (2019)
BindingDB Entry DOI: 10.7270/Q22Z17M7
Flap endonuclease 1
(Homo sapiens (Human))
BDBM323019
(1-Methyl-4-[({(1R,2R)-2-[4-(3-methyl-1H- pyrazol-5...)
Show SMILES Cc1cc(n[nH]1)-c1ccc(cc1)C(=O)[C@@H]1CCCC[C@H]1C(=O)Nc1cn(C)nc1C(N)=O |r|
Reactome pathway
US Patent
n/an/a 36n/an/an/an/an/an/a
ASTRAZENECA AB
US Patent
Assay Description
Compounds were tested in a competition binding assay using 3H-MK591 as tracer. (Preparation of MK-591 is described in Bioorg. Med. Chem. Lett. 1999, ...
US Patent US11001589 (2021)
5-lipoxygenase/FLAP
(Homo sapiens (Human))
BDBM323019
(1-Methyl-4-[({(1R,2R)-2-[4-(3-methyl-1H- pyrazol-5...)
Show SMILES Cc1cc(n[nH]1)-c1ccc(cc1)C(=O)[C@@H]1CCCC[C@H]1C(=O)Nc1cn(C)nc1C(N)=O |r|
Reactome pathway
US Patent
n/an/a 36n/an/an/an/an/an/a
ASTRAZENECA AB
US Patent
Assay Description
Compounds were tested in a competition binding assay using 3H-MK591 as tracer. (Preparation of MK-591 is described in Bioorg. Med. Chem. Lett. 1999, ...
US Patent US10508119 (2019)
BindingDB Entry DOI: 10.7270/Q2FB55BJ