null
SMILES: CNS(=O)(=O)c1c(NC(=O)[C@@H]2CCCC[C@H]2C(=O)c2ccc(cc2)-c2cc(C)n[nH]2)cnn1C
InChI Key:
Activity Spreadsheet -- Enzyme Inhibition Constant Data from BindingDB
Found 3 hits for monomerid = 323042
Trg + Lig
Ki
nM
ΔG°
kcal/mole
IC50
nM
Kd
nM
EC50/IC50
nM
koff
s-1
kon
M-1s-1
pHTemp
°C
Polyunsaturated fatty acid 5-lipoxygenase
(Homo sapiens (Human))
BDBM323042
((1R,2R)-N-[1-Methyl-5- (melhyIsulfamoyl)-1H-pyrazo...)
Show SMILES CNS(=O)(=O)c1c(NC(=O)[C@@H]2CCCC[C@H]2C(=O)c2ccc(cc2)-c2cc(C)n[nH]2)cnn1C |r|
Reactome pathway
US Patent
n/an/a 25n/an/an/an/an/an/a
ASTRAZENECA AB
US Patent
Assay Description
Compounds were tested in a competition binding assay using 3H-MK591 as tracer. (Preparation of MK-591 is described in Bioorg. Med. Chem. Lett. 1999, ...
US Patent US10183947 (2019)
BindingDB Entry DOI: 10.7270/Q22Z17M7
Flap endonuclease 1
(Homo sapiens (Human))
BDBM323042
((1R,2R)-N-[1-Methyl-5- (melhyIsulfamoyl)-1H-pyrazo...)
Show SMILES CNS(=O)(=O)c1c(NC(=O)[C@@H]2CCCC[C@H]2C(=O)c2ccc(cc2)-c2cc(C)n[nH]2)cnn1C |r|
Reactome pathway
US Patent
n/an/a 25n/an/an/an/an/an/a
ASTRAZENECA AB
US Patent
Assay Description
Compounds were tested in a competition binding assay using 3H-MK591 as tracer. (Preparation of MK-591 is described in Bioorg. Med. Chem. Lett. 1999, ...
US Patent US11001589 (2021)
Arachidonate 5-lipoxygenase-activating protein
(Homo sapiens (Human))
BDBM323042
((1R,2R)-N-[1-Methyl-5- (melhyIsulfamoyl)-1H-pyrazo...)
Show SMILES CNS(=O)(=O)c1c(NC(=O)[C@@H]2CCCC[C@H]2C(=O)c2ccc(cc2)-c2cc(C)n[nH]2)cnn1C |r|
Reactome pathway
US Patent
n/an/a 25n/an/an/an/an/an/a
ASTRAZENECA AB
US Patent
Assay Description
Compounds were tested in a competition binding assay using 3H-MK591 as tracer. (Preparation of MK-591 is described in Bioorg. Med. Chem. Lett. 1999, ...
US Patent US10508119 (2019)
BindingDB Entry DOI: 10.7270/Q2FB55BJ