BDBM323106 US9630931, Example 4
SMILES: COc1cc(CCNC[C@H]2CNCCO2)c(Cl)cc1NC(=O)Nc1cnc(cn1)C#N
InChI Key: InChIKey=WTZIDCPBBJAZMQ-HNNXBMFYSA-N
Data: 1 IC50
Activity Spreadsheet -- Enzyme Inhibition Constant Data from BindingDB
Found 1 hit for monomerid = 323106
Trg + Lig
Ki
nM
ΔG°
kcal/mole
IC50
nM
Kd
nM
EC50/IC50
nM
koff
s-1
kon
M-1s-1
pHTemp
°C
Serine/threonine-protein kinase Chk1
(Homo sapiens (Human))
BDBM323106
(US9630931, Example 4)
Show SMILES COc1cc(CCNC[C@H]2CNCCO2)c(Cl)cc1NC(=O)Nc1cnc(cn1)C#N |r|
Show InChI InChI=1S/C20H24ClN7O3/c1-30-18-6-13(2-3-23-10-15-11-24-4-5-31-15)16(21)7-17(18)27-20(29)28-19-12-25-14(8-22)9-26-19/h6-7,9,12,15,23-24H,2-5,10-11H2,1H3,(H2,26,27,28,29)/t15-/m0/s1
Reactome pathway
US Patent
n/an/a 0.0500n/an/an/an/an/an/a
SENTINEL ONCOLOGY LIMITED
US Patent
Assay Description
Reaction Buffer:Base Reaction buffer: 20 mM Hepes (pH 7.5), 10 mM MgCl2, 1 mM EGTA, 0.02% Brij35, 0.02 mg/ml BSA, 0.1 mM Na3VO4, 2 mM DTT, 1% DMSOReq...
US Patent US9630931 (2017)
BindingDB Entry DOI: 10.7270/Q29C70J1