null
SMILES: COc1cc(CCN[C@H](C)C2CCN(CC2)S(C)(=O)=O)c(Cl)cc1NC(=O)Nc1cnc(cn1)C#N
InChI Key: InChIKey=OKGVVUKWJXNKCR-OAHLLOKOSA-N
Activity Spreadsheet -- Enzyme Inhibition Constant Data from BindingDB
Found 1 hit for monomerid = 323150
Trg + Lig
Ki
nM
ΔG°
kcal/mole
IC50
nM
Kd
nM
EC50/IC50
nM
koff
s-1
kon
M-1s-1
pHTemp
°C
Serine/threonine-protein kinase Chk1
(Homo sapiens (Human))
BDBM323150
(US9630931, Example 13)
Show SMILES COc1cc(CCN[C@H](C)C2CCN(CC2)S(C)(=O)=O)c(Cl)cc1NC(=O)Nc1cnc(cn1)C#N |r|
Show InChI InChI=1S/C23H30ClN7O4S/c1-15(16-5-8-31(9-6-16)36(3,33)34)26-7-4-17-10-21(35-2)20(11-19(17)24)29-23(32)30-22-14-27-18(12-25)13-28-22/h10-11,13-16,26H,4-9H2,1-3H3,(H2,28,29,30,32)/t15-/m1/s1
Reactome pathway
US Patent
n/an/a 0.270n/an/an/an/an/an/a
SENTINEL ONCOLOGY LIMITED
US Patent
Assay Description
Reaction Buffer:Base Reaction buffer: 20 mM Hepes (pH 7.5), 10 mM MgCl2, 1 mM EGTA, 0.02% Brij35, 0.02 mg/ml BSA, 0.1 mM Na3VO4, 2 mM DTT, 1% DMSOReq...
US Patent US9630931 (2017)
BindingDB Entry DOI: 10.7270/Q29C70J1