BDBM323169 US9630931, Example 27
SMILES: CC(C)Oc1cc(CCNCC(=O)N2CCOCC2)c(Cl)cc1NC(=O)Nc1cnc(cn1)C#N
InChI Key: InChIKey=RBAHMBLVTKGWRU-UHFFFAOYSA-N
Data: 1 IC50
Activity Spreadsheet -- Enzyme Inhibition Constant Data from BindingDB
Found 1 hit for monomerid = 323169
Trg + Lig
Ki
nM
ΔG°
kcal/mole
IC50
nM
Kd
nM
EC50/IC50
nM
koff
s-1
kon
M-1s-1
pHTemp
°C
Serine/threonine-protein kinase Chk1
(Homo sapiens (Human))
BDBM323169
(US9630931, Example 27)
Show SMILES CC(C)Oc1cc(CCNCC(=O)N2CCOCC2)c(Cl)cc1NC(=O)Nc1cnc(cn1)C#N
Show InChI InChI=1S/C23H28ClN7O4/c1-15(2)35-20-9-16(3-4-26-14-22(32)31-5-7-34-8-6-31)18(24)10-19(20)29-23(33)30-21-13-27-17(11-25)12-28-21/h9-10,12-13,15,26H,3-8,14H2,1-2H3,(H2,28,29,30,33)
Reactome pathway
US Patent
n/an/a 0.210n/an/an/an/an/an/a
SENTINEL ONCOLOGY LIMITED
US Patent
Assay Description
Reaction Buffer:Base Reaction buffer: 20 mM Hepes (pH 7.5), 10 mM MgCl2, 1 mM EGTA, 0.02% Brij35, 0.02 mg/ml BSA, 0.1 mM Na3VO4, 2 mM DTT, 1% DMSOReq...
US Patent US9630931 (2017)
BindingDB Entry DOI: 10.7270/Q29C70J1