BDBM323170 US9630931, Example 28
SMILES: COc1cc(CCN[C@@H](C)C(=O)N2CCOCC2)c(Cl)cc1NC(=O)Nc1cnc(cn1)C#N
InChI Key: InChIKey=PFFSXAXIXOXBQH-AWEZNQCLSA-N
Data: 1 IC50
Activity Spreadsheet -- Enzyme Inhibition Constant Data from BindingDB
Found 1 hit for monomerid = 323170
Trg + Lig
Ki
nM
ΔG°
kcal/mole
IC50
nM
Kd
nM
EC50/IC50
nM
koff
s-1
kon
M-1s-1
pHTemp
°C
Serine/threonine-protein kinase Chk1
(Homo sapiens (Human))
BDBM323170
(US9630931, Example 28)
Show SMILES COc1cc(CCN[C@@H](C)C(=O)N2CCOCC2)c(Cl)cc1NC(=O)Nc1cnc(cn1)C#N |r|
Show InChI InChI=1S/C22H26ClN7O4/c1-14(21(31)30-5-7-34-8-6-30)25-4-3-15-9-19(33-2)18(10-17(15)23)28-22(32)29-20-13-26-16(11-24)12-27-20/h9-10,12-14,25H,3-8H2,1-2H3,(H2,27,28,29,32)/t14-/m0/s1
Reactome pathway
US Patent
n/an/a 0.480n/an/an/an/an/an/a
SENTINEL ONCOLOGY LIMITED
US Patent
Assay Description
Reaction Buffer:Base Reaction buffer: 20 mM Hepes (pH 7.5), 10 mM MgCl2, 1 mM EGTA, 0.02% Brij35, 0.02 mg/ml BSA, 0.1 mM Na3VO4, 2 mM DTT, 1% DMSOReq...
US Patent US9630931 (2017)
BindingDB Entry DOI: 10.7270/Q29C70J1