null
SMILES: [O-][N+](=O)c1ccc(Nc2c3ccccc3nc3ccccc23)cc1
InChI Key: InChIKey=PAOOQRRWBZDBPN-UHFFFAOYSA-N
Activity Spreadsheet -- Enzyme Inhibition Constant Data from BindingDB
Found 5 hits for monomerid = 32344
Trg + Lig
Ki
nM
ΔG°
kcal/mole
IC50
nM
Kd
nM
EC50/IC50
nM
koff
s-1
kon
M-1s-1
pHTemp
°C
Serine/threonine-protein kinase D1
(Homo sapiens (Human))
BDBM32344
(MLS000723809 | N-(4-nitrophenyl)-9-acridinamine | ...)
Show SMILES [O-][N+](=O)c1ccc(Nc2c3ccccc3nc3ccccc23)cc1
Show InChI InChI=1S/C19H13N3O2/c23-22(24)14-11-9-13(10-12-14)20-19-15-5-1-3-7-17(15)21-18-8-4-2-6-16(18)19/h1-12H,(H,20,21)
NCI pathway
Reactome pathway
PCBioAssay
n/an/a>5.00E+4n/an/an/an/a7.223
University of Pittsburgh Molecular Library Screening Center
Curated by PubChem BioAssay
Assay Description
The PKD HTS assay was developed and run at the University of Pittsburgh Molecular Screening Center (PMLSC) as part of the Molecular Library Screening...
PubChem Bioassay (2008)
BindingDB Entry DOI: 10.7270/Q2FJ2F43
RAC-alpha serine/threonine-protein kinase
(Homo sapiens (Human))
BDBM32344
(MLS000723809 | N-(4-nitrophenyl)-9-acridinamine | ...)
Show SMILES [O-][N+](=O)c1ccc(Nc2c3ccccc3nc3ccccc23)cc1
Show InChI InChI=1S/C19H13N3O2/c23-22(24)14-11-9-13(10-12-14)20-19-15-5-1-3-7-17(15)21-18-8-4-2-6-16(18)19/h1-12H,(H,20,21)
PCBioAssay
n/an/a>1.00E+5n/an/an/an/an/an/a
University of Pittsburgh Molecular Library Screening Center
Curated by PubChem BioAssay
Assay Description
The PKD HTS assay was developed and run at the University of Pittsburgh Molecular Screening Center (PMLSC) as part of the Molecular Library Screening...
PubChem Bioassay (2008)
BindingDB Entry DOI: 10.7270/Q2JM282R
Importin subunit alpha-1
(Homo sapiens (Human))
BDBM32344
(MLS000723809 | N-(4-nitrophenyl)-9-acridinamine | ...)
Show SMILES [O-][N+](=O)c1ccc(Nc2c3ccccc3nc3ccccc23)cc1
Show InChI InChI=1S/C19H13N3O2/c23-22(24)14-11-9-13(10-12-14)20-19-15-5-1-3-7-17(15)21-18-8-4-2-6-16(18)19/h1-12H,(H,20,21)
Reactome pathway
PCBioAssay
n/an/an/an/a>5.00E+5n/an/an/an/a
Broad Institute
Curated by PubChem BioAssay
Assay Description
Keywords: Counterscreen, FRET assay, HTS, YIC probe, Dose response, Assay Overview: This is a fluorescence resonance energy transfer (FRET)-based b...
PubChem Bioassay (2010)
BindingDB Entry DOI: 10.7270/Q280513R
Serine/threonine-protein kinase D1
(Homo sapiens (Human))
BDBM32344
(MLS000723809 | N-(4-nitrophenyl)-9-acridinamine | ...)
Show SMILES [O-][N+](=O)c1ccc(Nc2c3ccccc3nc3ccccc23)cc1
Show InChI InChI=1S/C19H13N3O2/c23-22(24)14-11-9-13(10-12-14)20-19-15-5-1-3-7-17(15)21-18-8-4-2-6-16(18)19/h1-12H,(H,20,21)
NCI pathway
Reactome pathway
PCBioAssay
n/an/a>5.00E+4n/an/an/an/an/an/a
University of Pittsburgh Molecular Library Screening Center
Curated by PubChem BioAssay
Assay Description
The PKD HTS assay was developed and run at the University of Pittsburgh Molecular Screening Center (PMLSC) as part of the Molecular Library Screening...
PubChem Bioassay (2008)
BindingDB Entry DOI: 10.7270/Q2ZG6QNM
Cyclin-dependent kinase 7
(Homo sapiens (Human))
BDBM32344
(MLS000723809 | N-(4-nitrophenyl)-9-acridinamine | ...)
Show SMILES [O-][N+](=O)c1ccc(Nc2c3ccccc3nc3ccccc23)cc1
Show InChI InChI=1S/C19H13N3O2/c23-22(24)14-11-9-13(10-12-14)20-19-15-5-1-3-7-17(15)21-18-8-4-2-6-16(18)19/h1-12H,(H,20,21)
NCI pathway
Reactome pathway
PCBioAssay
n/an/a>1.00E+5n/an/an/an/an/an/a
University of Pittsburgh Molecular Library Screening Center
Curated by PubChem BioAssay
Assay Description
The PKD HTS assay was developed and run at the University of Pittsburgh Molecular Screening Center (PMLSC) as part of the Molecular Library Screening...
PubChem Bioassay (2008)
BindingDB Entry DOI: 10.7270/Q2DV1H9K