BDBM32414 furan-2-carboxamide deriv., 26
SMILES: CNC(=O)[C@@H](NC(=O)c1ccc(o1)-c1ccc(OCc2ccn[nH]2)cn1)C1CCCCC1
InChI Key: InChIKey=ZACZGYFEWPTMFL-NRFANRHFSA-N
Data: 1 IC50
Activity Spreadsheet -- Enzyme Inhibition Constant Data from BindingDB
Found 1 hit for monomerid = 32414
Trg + Lig
Ki
nM
ΔG°
kcal/mole
IC50
nM
Kd
nM
EC50/IC50
nM
koff
s-1
kon
M-1s-1
pHTemp
°C
Collagenase 3
(Homo sapiens (Human))
BDBM32414
(furan-2-carboxamide deriv., 26)
Show SMILES CNC(=O)[C@@H](NC(=O)c1ccc(o1)-c1ccc(OCc2ccn[nH]2)cn1)C1CCCCC1 |r|
Show InChI InChI=1S/C23H27N5O4/c1-24-23(30)21(15-5-3-2-4-6-15)27-22(29)20-10-9-19(32-20)18-8-7-17(13-25-18)31-14-16-11-12-26-28-16/h7-13,15,21H,2-6,14H2,1H3,(H,24,30)(H,26,28)(H,27,29)/t21-/m0/s1
NCI pathway
Reactome pathway
n/an/a 6n/an/an/an/a7.537
Boehringer Ingelheim Pharmaceuticals
Assay Description
MMP-13 was assessed by using the EnzoLyte 520 Generic MMP Assay Kit (AnaSpec Inc.). This kit uses a 5-FAM/QXL 520 fluorescence resonance 10 energy tr...
Bioorg Med Chem Lett 19: 5321-4 (2009)
Article DOI: 10.1016/j.bmcl.2009.07.151
BindingDB Entry DOI: 10.7270/Q22B8WCD