BDBM324230 US10189819, Example 67
SMILES: COc1cc2nc([nH]c2cc1Cl)[C@@H](CNC(=O)c1c(Cl)cc(cc1Cl)-n1cnc(C)n1)c1cccc(c1)C(=O)NC1CC1
InChI Key:
Data: 1 IC50
Activity Spreadsheet -- Enzyme Inhibition Constant Data from BindingDB
Found 1 hit for monomerid = 324230
Trg + Lig
Ki
nM
ΔG°
kcal/mole
IC50
nM
Kd
nM
EC50/IC50
nM
koff
s-1
kon
M-1s-1
pHTemp
°C
Coagulation factor IX
(Homo sapiens (Human))
BDBM324230
(US10189819, Example 67)
Show SMILES COc1cc2nc([nH]c2cc1Cl)[C@@H](CNC(=O)c1c(Cl)cc(cc1Cl)-n1cnc(C)n1)c1cccc(c1)C(=O)NC1CC1 |r|
Reactome pathway
US Patent
n/an/a 2.90n/an/an/an/an/an/a
Merck Sharp & Dohme, Corp.; Mochida Paraceuticals Co., Ltd.
US Patent
Assay Description
Formation of a clot to stem bleeding at a site of blood vessel injury involves the coordinated activity of a group of plasma proteins that initiate a...
US Patent US10189819 (2019)
BindingDB Entry DOI: 10.7270/Q200046Z