BDBM324417 US10189835, Compound 595
SMILES: CON(C(C)C)C(=O)c1n[nH]c2CCN(Cc12)C(=O)Nc1cccc(Cl)c1
InChI Key: InChIKey=PQQPEAPWNBGNFG-UHFFFAOYSA-N
Data: 1 EC50
Activity Spreadsheet -- Enzyme Inhibition Constant Data from BindingDB
Found 1 hit for monomerid = 324417
Trg + Lig
Ki
nM
ΔG°
kcal/mole
IC50
nM
Kd
nM
EC50/IC50
nM
koff
s-1
kon
M-1s-1
pHTemp
°C
Capsid protein
(Hepatitis B virus genotype C subtype ayr (isolate ...)
BDBM324417
(US10189835, Compound 595)
Show SMILES CON(C(C)C)C(=O)c1n[nH]c2CCN(Cc12)C(=O)Nc1cccc(Cl)c1
Show InChI InChI=1S/C18H22ClN5O3/c1-11(2)24(27-3)17(25)16-14-10-23(8-7-15(14)21-22-16)18(26)20-13-6-4-5-12(19)9-13/h4-6,9,11H,7-8,10H2,1-3H3,(H,20,26)(H,21,22)
US Patent
n/an/an/an/a<500n/an/an/an/a
NOVIRA THERAPEUTICS, INC.
US Patent
Assay Description
HBV replication inhibition by the compounds of this invention could be determined in cells infected or transfected with HBV, or cells with stably int...
US Patent US10189835 (2019)
BindingDB Entry DOI: 10.7270/Q2KP8482