BDBM324422 US10189835, Compound 698
SMILES: FC1CON(C1)C(=O)c1n[nH]c2CCN(Cc12)C(=O)Nc1cccc(Cl)c1
InChI Key:
Data: 1 EC50
Activity Spreadsheet -- Enzyme Inhibition Constant Data from BindingDB
Found 1 hit for monomerid = 324422
Trg + Lig
Ki
nM
ΔG°
kcal/mole
IC50
nM
Kd
nM
EC50/IC50
nM
koff
s-1
kon
M-1s-1
pHTemp
°C
Capsid protein
(Hepatitis B virus genotype C subtype ayr (isolate ...)
BDBM324422
(US10189835, Compound 698)
Show SMILES FC1CON(C1)C(=O)c1n[nH]c2CCN(Cc12)C(=O)Nc1cccc(Cl)c1
US Patent
n/an/an/an/a<100n/an/an/an/a
NOVIRA THERAPEUTICS, INC.
US Patent
Assay Description
HBV replication inhibition by the compounds of this invention could be determined in cells infected or transfected with HBV, or cells with stably int...
US Patent US10189835 (2019)
BindingDB Entry DOI: 10.7270/Q2KP8482