null
SMILES: Cc1ccc(cc1F)-c1cccc(n1)C(=O)N1CCCC(C)(C)C1
InChI Key: InChIKey=SIDDLTBLAQYZIZ-UHFFFAOYSA-N
PDB links: 1 PDB ID matches this monomer.
Activity Spreadsheet -- Enzyme Inhibition Constant Data from BindingDB
Found 1 hit for monomerid = 32522
Trg + Lig
Ki
nM
ΔG°
kcal/mole
IC50
nM
Kd
nM
EC50/IC50
nM
koff
s-1
kon
M-1s-1
pHTemp
°C
11-beta-hydroxysteroid dehydrogenase 1 [23-292,A23S,F278E]
(Homo sapiens (Human))
BDBM32522
(pyridine amide, 30)
Show SMILES Cc1ccc(cc1F)-c1cccc(n1)C(=O)N1CCCC(C)(C)C1
Show InChI InChI=1S/C20H23FN2O/c1-14-8-9-15(12-16(14)21)17-6-4-7-18(22-17)19(24)23-11-5-10-20(2,3)13-23/h4,6-9,12H,5,10-11,13H2,1-3H3
n/an/a 0.100n/an/an/an/a6.523
Bristol-Myers Squibb Company
Assay Description
11beta-HSD1 microsomes isolated from HEK 293 cells over-expressing human 11beta-HSD1 were incubated with the substrate cortisone and cofactor NADPH a...
Bioorg Med Chem Lett 18: 3168-72 (2008)
Article DOI: 10.1016/j.bmcl.2008.04.069
BindingDB Entry DOI: 10.7270/Q2P26WGT
3D
3D Structure (crystal)