BDBM325369 1-(4-(4-(4-(1-(pentan-3-yl)-1H-pyrazol-4-yl)pyrazolo[1,5-a]pyrazin-6-yl)-1H-pyrazol-1-yl)piperidin-1-yl)ethanone::US10189845, Example 31::US10730880, Example 31
SMILES: CCC(CC)n1cc(cn1)-c1nc(cn2nccc12)-c1cnn(c1)C1CCN(CC1)C(C)=O
InChI Key: InChIKey=IBNMAQFIGSSRFF-UHFFFAOYSA-N
Data: 12 IC50
Activity Spreadsheet -- Enzyme Inhibition Constant Data from BindingDB
Found 12 hits for monomerid = 325369
Trg + Lig
Ki
nM
ΔG°
kcal/mole
IC50
nM
Kd
nM
EC50/IC50
nM
koff
s-1
kon
M-1s-1
pHTemp
°C
Non-receptor tyrosine-protein kinase TYK2
(Homo sapiens (Human))
BDBM325369
(1-(4-(4-(4-(1-(pentan-3-yl)-1H-pyrazol-4-yl)pyrazo...)
Show SMILES CCC(CC)n1cc(cn1)-c1nc(cn2nccc12)-c1cnn(c1)C1CCN(CC1)C(C)=O
Show InChI InChI=1S/C24H30N8O/c1-4-20(5-2)30-15-19(13-27-30)24-23-6-9-25-32(23)16-22(28-24)18-12-26-31(14-18)21-7-10-29(11-8-21)17(3)33/h6,9,12-16,20-21H,4-5,7-8,10-11H2,1-3H3
US Patent
n/an/a 55n/an/an/an/an/an/a
Array BioPharma Inc.
US Patent
Assay Description
Compounds of Formula I were screened for their ability to inhibit Tyk2 using the general enzyme inhibition assay method, in which the assay mixture c...
US Patent US10189845 (2019)
BindingDB Entry DOI: 10.7270/Q2Z03B7Q
Tyrosine-protein kinase JAK1
(Homo sapiens (Human))
BDBM325369
(1-(4-(4-(4-(1-(pentan-3-yl)-1H-pyrazol-4-yl)pyrazo...)
Show SMILES CCC(CC)n1cc(cn1)-c1nc(cn2nccc12)-c1cnn(c1)C1CCN(CC1)C(C)=O
Show InChI InChI=1S/C24H30N8O/c1-4-20(5-2)30-15-19(13-27-30)24-23-6-9-25-32(23)16-22(28-24)18-12-26-31(14-18)21-7-10-29(11-8-21)17(3)33/h6,9,12-16,20-21H,4-5,7-8,10-11H2,1-3H3
Reactome pathway
US Patent
n/an/a 550n/an/an/an/an/an/a
Array BioPharma Inc.
US Patent
Assay Description
Compounds of Formula I were screened for their ability to inhibit JAK1 using the general enzyme inhibition assay method, in which the assay mixture c...
US Patent US10189845 (2019)
BindingDB Entry DOI: 10.7270/Q2Z03B7Q
Tyrosine-protein kinase JAK2
(Homo sapiens (Human))
BDBM325369
(1-(4-(4-(4-(1-(pentan-3-yl)-1H-pyrazol-4-yl)pyrazo...)
Show SMILES CCC(CC)n1cc(cn1)-c1nc(cn2nccc12)-c1cnn(c1)C1CCN(CC1)C(C)=O
Show InChI InChI=1S/C24H30N8O/c1-4-20(5-2)30-15-19(13-27-30)24-23-6-9-25-32(23)16-22(28-24)18-12-26-31(14-18)21-7-10-29(11-8-21)17(3)33/h6,9,12-16,20-21H,4-5,7-8,10-11H2,1-3H3
Reactome pathway
US Patent
n/an/a<10n/an/an/an/an/an/a
Array BioPharma Inc.
US Patent
Assay Description
Compounds of Formula I were screened for their ability to inhibit JAK2 using the general enzyme inhibition assay method, in which the assay mixture c...
US Patent US10189845 (2019)
BindingDB Entry DOI: 10.7270/Q2Z03B7Q
Tyrosine-protein kinase JAK3
(Homo sapiens (Human))
BDBM325369
(1-(4-(4-(4-(1-(pentan-3-yl)-1H-pyrazol-4-yl)pyrazo...)
Show SMILES CCC(CC)n1cc(cn1)-c1nc(cn2nccc12)-c1cnn(c1)C1CCN(CC1)C(C)=O
Show InChI InChI=1S/C24H30N8O/c1-4-20(5-2)30-15-19(13-27-30)24-23-6-9-25-32(23)16-22(28-24)18-12-26-31(14-18)21-7-10-29(11-8-21)17(3)33/h6,9,12-16,20-21H,4-5,7-8,10-11H2,1-3H3
Reactome pathway
US Patent
n/an/a 5.50E+3n/an/an/an/an/an/a
Array BioPharma Inc.
US Patent
Assay Description
Compounds of Formula I were screened for their ability to inhibit JAK3 using the general enzyme inhibition assay method, in which the assay mixture c...
US Patent US10189845 (2019)
BindingDB Entry DOI: 10.7270/Q2Z03B7Q
Non-receptor tyrosine-protein kinase TYK2
(Homo sapiens (Human))
BDBM325369
(1-(4-(4-(4-(1-(pentan-3-yl)-1H-pyrazol-4-yl)pyrazo...)
Show SMILES CCC(CC)n1cc(cn1)-c1nc(cn2nccc12)-c1cnn(c1)C1CCN(CC1)C(C)=O
Show InChI InChI=1S/C24H30N8O/c1-4-20(5-2)30-15-19(13-27-30)24-23-6-9-25-32(23)16-22(28-24)18-12-26-31(14-18)21-7-10-29(11-8-21)17(3)33/h6,9,12-16,20-21H,4-5,7-8,10-11H2,1-3H3
US Patent
n/an/a 55n/an/an/an/an/an/a
Array BioPharma Inc.; Celgene Corporation
US Patent
Assay Description
Compounds of Formula I were screened for their ability to inhibit Tyk2 using the general enzyme inhibition assay method, in which the assay mixture c...
US Patent US10730880 (2020)
Tyrosine-protein kinase JAK3
(Homo sapiens (Human))
BDBM325369
(1-(4-(4-(4-(1-(pentan-3-yl)-1H-pyrazol-4-yl)pyrazo...)
Show SMILES CCC(CC)n1cc(cn1)-c1nc(cn2nccc12)-c1cnn(c1)C1CCN(CC1)C(C)=O
Show InChI InChI=1S/C24H30N8O/c1-4-20(5-2)30-15-19(13-27-30)24-23-6-9-25-32(23)16-22(28-24)18-12-26-31(14-18)21-7-10-29(11-8-21)17(3)33/h6,9,12-16,20-21H,4-5,7-8,10-11H2,1-3H3
Reactome pathway
US Patent
n/an/a 5.50E+3n/an/an/an/an/an/a
ARRAY BIOPHARMA INC.; CELGENE CORPORATION
US Patent
Assay Description
Compounds of Formula I were screened for their ability to inhibit JAK3 using the general enzyme inhibition assay method, in which the assay mixture c...
US Patent US11028093 (2021)
Tyrosine-protein kinase JAK2
(Homo sapiens (Human))
BDBM325369
(1-(4-(4-(4-(1-(pentan-3-yl)-1H-pyrazol-4-yl)pyrazo...)
Show SMILES CCC(CC)n1cc(cn1)-c1nc(cn2nccc12)-c1cnn(c1)C1CCN(CC1)C(C)=O
Show InChI InChI=1S/C24H30N8O/c1-4-20(5-2)30-15-19(13-27-30)24-23-6-9-25-32(23)16-22(28-24)18-12-26-31(14-18)21-7-10-29(11-8-21)17(3)33/h6,9,12-16,20-21H,4-5,7-8,10-11H2,1-3H3
Reactome pathway
US Patent
n/an/a<10n/an/an/an/an/an/a
Array BioPharma Inc.; Celgene Corporation
US Patent
Assay Description
Compounds of Formula I were screened for their ability to inhibit JAK2 using the general enzyme inhibition assay method, in which the assay mixture c...
US Patent US10730880 (2020)
Tyrosine-protein kinase JAK3
(Homo sapiens (Human))
BDBM325369
(1-(4-(4-(4-(1-(pentan-3-yl)-1H-pyrazol-4-yl)pyrazo...)
Show SMILES CCC(CC)n1cc(cn1)-c1nc(cn2nccc12)-c1cnn(c1)C1CCN(CC1)C(C)=O
Show InChI InChI=1S/C24H30N8O/c1-4-20(5-2)30-15-19(13-27-30)24-23-6-9-25-32(23)16-22(28-24)18-12-26-31(14-18)21-7-10-29(11-8-21)17(3)33/h6,9,12-16,20-21H,4-5,7-8,10-11H2,1-3H3
Reactome pathway
US Patent
n/an/a 5.50E+3n/an/an/an/an/an/a
Array BioPharma Inc.; Celgene Corporation
US Patent
Assay Description
Compounds of Formula I were screened for their ability to inhibit JAK3 using the general enzyme inhibition assay method, in which the assay mixture c...
US Patent US10730880 (2020)
Non-receptor tyrosine-protein kinase TYK2
(Homo sapiens (Human))
BDBM325369
(1-(4-(4-(4-(1-(pentan-3-yl)-1H-pyrazol-4-yl)pyrazo...)
Show SMILES CCC(CC)n1cc(cn1)-c1nc(cn2nccc12)-c1cnn(c1)C1CCN(CC1)C(C)=O
Show InChI InChI=1S/C24H30N8O/c1-4-20(5-2)30-15-19(13-27-30)24-23-6-9-25-32(23)16-22(28-24)18-12-26-31(14-18)21-7-10-29(11-8-21)17(3)33/h6,9,12-16,20-21H,4-5,7-8,10-11H2,1-3H3
US Patent
n/an/a 55n/an/an/an/an/an/a
ARRAY BIOPHARMA INC.; CELGENE CORPORATION
US Patent
Assay Description
Compounds of Formula I were screened for their ability to inhibit Tyk2 using the general enzyme inhibition assay method, in which the assay mixture c...
US Patent US11028093 (2021)
Tyrosine-protein kinase JAK1
(Homo sapiens (Human))
BDBM325369
(1-(4-(4-(4-(1-(pentan-3-yl)-1H-pyrazol-4-yl)pyrazo...)
Show SMILES CCC(CC)n1cc(cn1)-c1nc(cn2nccc12)-c1cnn(c1)C1CCN(CC1)C(C)=O
Show InChI InChI=1S/C24H30N8O/c1-4-20(5-2)30-15-19(13-27-30)24-23-6-9-25-32(23)16-22(28-24)18-12-26-31(14-18)21-7-10-29(11-8-21)17(3)33/h6,9,12-16,20-21H,4-5,7-8,10-11H2,1-3H3
Reactome pathway
US Patent
n/an/a 550n/an/an/an/an/an/a
ARRAY BIOPHARMA INC.; CELGENE CORPORATION
US Patent
Assay Description
Compounds of Formula I were screened for their ability to inhibit JAK1 using the general enzyme inhibition assay method, in which the assay mixture c...
US Patent US11028093 (2021)
Tyrosine-protein kinase JAK2
(Homo sapiens (Human))
BDBM325369
(1-(4-(4-(4-(1-(pentan-3-yl)-1H-pyrazol-4-yl)pyrazo...)
Show SMILES CCC(CC)n1cc(cn1)-c1nc(cn2nccc12)-c1cnn(c1)C1CCN(CC1)C(C)=O
Show InChI InChI=1S/C24H30N8O/c1-4-20(5-2)30-15-19(13-27-30)24-23-6-9-25-32(23)16-22(28-24)18-12-26-31(14-18)21-7-10-29(11-8-21)17(3)33/h6,9,12-16,20-21H,4-5,7-8,10-11H2,1-3H3
Reactome pathway
US Patent
n/an/a<10n/an/an/an/an/an/a
ARRAY BIOPHARMA INC.; CELGENE CORPORATION
US Patent
Assay Description
Compounds of Formula I were screened for their ability to inhibit JAK2 using the general enzyme inhibition assay method, in which the assay mixture c...
US Patent US11028093 (2021)
Tyrosine-protein kinase JAK1
(Homo sapiens (Human))
BDBM325369
(1-(4-(4-(4-(1-(pentan-3-yl)-1H-pyrazol-4-yl)pyrazo...)
Show SMILES CCC(CC)n1cc(cn1)-c1nc(cn2nccc12)-c1cnn(c1)C1CCN(CC1)C(C)=O
Show InChI InChI=1S/C24H30N8O/c1-4-20(5-2)30-15-19(13-27-30)24-23-6-9-25-32(23)16-22(28-24)18-12-26-31(14-18)21-7-10-29(11-8-21)17(3)33/h6,9,12-16,20-21H,4-5,7-8,10-11H2,1-3H3
Reactome pathway
US Patent
n/an/a 550n/an/an/an/an/an/a
Array BioPharma Inc.; Celgene Corporation
US Patent
Assay Description
Compounds of Formula I were screened for their ability to inhibit JAK1 using the general enzyme inhibition assay method, in which the assay mixture c...
US Patent US10730880 (2020)