null
SMILES: CC[C@H](C)n1cc(cn1)-c1nc(cn2nccc12)-c1cnn(c1)C(CO)CO
InChI Key: InChIKey=NEIPUFXCLKLJBB-ZDUSSCGKSA-N
Activity Spreadsheet -- Enzyme Inhibition Constant Data from BindingDB
Found 12 hits for monomerid = 325422
Trg + Lig
Ki
nM
ΔG°
kcal/mole
IC50
nM
Kd
nM
EC50/IC50
nM
koff
s-1
kon
M-1s-1
pHTemp
°C
Non-receptor tyrosine-protein kinase TYK2
(Homo sapiens (Human))
BDBM325422
((S)-2-(4-(4-(1-(sec- butyl)-1H-pyrazol-4- yl)pyraz...)
Show SMILES CC[C@H](C)n1cc(cn1)-c1nc(cn2nccc12)-c1cnn(c1)C(CO)CO |r|
Show InChI InChI=1S/C19H23N7O2/c1-3-13(2)24-9-15(7-21-24)19-18-4-5-20-26(18)10-17(23-19)14-6-22-25(8-14)16(11-27)12-28/h4-10,13,16,27-28H,3,11-12H2,1-2H3/t13-/m0/s1
US Patent
n/an/a 550n/an/an/an/an/an/a
Array BioPharma Inc.
US Patent
Assay Description
Compounds of Formula I were screened for their ability to inhibit Tyk2 using the general enzyme inhibition assay method, in which the assay mixture c...
US Patent US10189845 (2019)
BindingDB Entry DOI: 10.7270/Q2Z03B7Q
Tyrosine-protein kinase JAK1
(Homo sapiens (Human))
BDBM325422
((S)-2-(4-(4-(1-(sec- butyl)-1H-pyrazol-4- yl)pyraz...)
Show SMILES CC[C@H](C)n1cc(cn1)-c1nc(cn2nccc12)-c1cnn(c1)C(CO)CO |r|
Show InChI InChI=1S/C19H23N7O2/c1-3-13(2)24-9-15(7-21-24)19-18-4-5-20-26(18)10-17(23-19)14-6-22-25(8-14)16(11-27)12-28/h4-10,13,16,27-28H,3,11-12H2,1-2H3/t13-/m0/s1
Reactome pathway
US Patent
n/an/a 5.50E+3n/an/an/an/an/an/a
Array BioPharma Inc.
US Patent
Assay Description
Compounds of Formula I were screened for their ability to inhibit JAK1 using the general enzyme inhibition assay method, in which the assay mixture c...
US Patent US10189845 (2019)
BindingDB Entry DOI: 10.7270/Q2Z03B7Q
Tyrosine-protein kinase JAK2
(Homo sapiens (Human))
BDBM325422
((S)-2-(4-(4-(1-(sec- butyl)-1H-pyrazol-4- yl)pyraz...)
Show SMILES CC[C@H](C)n1cc(cn1)-c1nc(cn2nccc12)-c1cnn(c1)C(CO)CO |r|
Show InChI InChI=1S/C19H23N7O2/c1-3-13(2)24-9-15(7-21-24)19-18-4-5-20-26(18)10-17(23-19)14-6-22-25(8-14)16(11-27)12-28/h4-10,13,16,27-28H,3,11-12H2,1-2H3/t13-/m0/s1
Reactome pathway
US Patent
n/an/a<10n/an/an/an/an/an/a
Array BioPharma Inc.
US Patent
Assay Description
Compounds of Formula I were screened for their ability to inhibit JAK2 using the general enzyme inhibition assay method, in which the assay mixture c...
US Patent US10189845 (2019)
BindingDB Entry DOI: 10.7270/Q2Z03B7Q
Tyrosine-protein kinase JAK3
(Homo sapiens (Human))
BDBM325422
((S)-2-(4-(4-(1-(sec- butyl)-1H-pyrazol-4- yl)pyraz...)
Show SMILES CC[C@H](C)n1cc(cn1)-c1nc(cn2nccc12)-c1cnn(c1)C(CO)CO |r|
Show InChI InChI=1S/C19H23N7O2/c1-3-13(2)24-9-15(7-21-24)19-18-4-5-20-26(18)10-17(23-19)14-6-22-25(8-14)16(11-27)12-28/h4-10,13,16,27-28H,3,11-12H2,1-2H3/t13-/m0/s1
Reactome pathway
US Patent
n/an/a 5.50E+3n/an/an/an/an/an/a
Array BioPharma Inc.
US Patent
Assay Description
Compounds of Formula I were screened for their ability to inhibit JAK3 using the general enzyme inhibition assay method, in which the assay mixture c...
US Patent US10189845 (2019)
BindingDB Entry DOI: 10.7270/Q2Z03B7Q
Non-receptor tyrosine-protein kinase TYK2
(Homo sapiens (Human))
BDBM325422
((S)-2-(4-(4-(1-(sec- butyl)-1H-pyrazol-4- yl)pyraz...)
Show SMILES CC[C@H](C)n1cc(cn1)-c1nc(cn2nccc12)-c1cnn(c1)C(CO)CO |r|
Show InChI InChI=1S/C19H23N7O2/c1-3-13(2)24-9-15(7-21-24)19-18-4-5-20-26(18)10-17(23-19)14-6-22-25(8-14)16(11-27)12-28/h4-10,13,16,27-28H,3,11-12H2,1-2H3/t13-/m0/s1
US Patent
n/an/a 55n/an/an/an/an/an/a
Array BioPharma Inc.; Celgene Corporation
US Patent
Assay Description
Compounds of Formula I were screened for their ability to inhibit Tyk2 using the general enzyme inhibition assay method, in which the assay mixture c...
US Patent US10730880 (2020)
Tyrosine-protein kinase JAK3
(Homo sapiens (Human))
BDBM325422
((S)-2-(4-(4-(1-(sec- butyl)-1H-pyrazol-4- yl)pyraz...)
Show SMILES CC[C@H](C)n1cc(cn1)-c1nc(cn2nccc12)-c1cnn(c1)C(CO)CO |r|
Show InChI InChI=1S/C19H23N7O2/c1-3-13(2)24-9-15(7-21-24)19-18-4-5-20-26(18)10-17(23-19)14-6-22-25(8-14)16(11-27)12-28/h4-10,13,16,27-28H,3,11-12H2,1-2H3/t13-/m0/s1
Reactome pathway
US Patent
n/an/a 5.50E+3n/an/an/an/an/an/a
ARRAY BIOPHARMA INC.; CELGENE CORPORATION
US Patent
Assay Description
Compounds of Formula I were screened for their ability to inhibit JAK3 using the general enzyme inhibition assay method, in which the assay mixture c...
US Patent US11028093 (2021)
Tyrosine-protein kinase JAK2
(Homo sapiens (Human))
BDBM325422
((S)-2-(4-(4-(1-(sec- butyl)-1H-pyrazol-4- yl)pyraz...)
Show SMILES CC[C@H](C)n1cc(cn1)-c1nc(cn2nccc12)-c1cnn(c1)C(CO)CO |r|
Show InChI InChI=1S/C19H23N7O2/c1-3-13(2)24-9-15(7-21-24)19-18-4-5-20-26(18)10-17(23-19)14-6-22-25(8-14)16(11-27)12-28/h4-10,13,16,27-28H,3,11-12H2,1-2H3/t13-/m0/s1
Reactome pathway
US Patent
n/an/a 55n/an/an/an/an/an/a
Array BioPharma Inc.; Celgene Corporation
US Patent
Assay Description
Compounds of Formula I were screened for their ability to inhibit JAK2 using the general enzyme inhibition assay method, in which the assay mixture c...
US Patent US10730880 (2020)
Tyrosine-protein kinase JAK3
(Homo sapiens (Human))
BDBM325422
((S)-2-(4-(4-(1-(sec- butyl)-1H-pyrazol-4- yl)pyraz...)
Show SMILES CC[C@H](C)n1cc(cn1)-c1nc(cn2nccc12)-c1cnn(c1)C(CO)CO |r|
Show InChI InChI=1S/C19H23N7O2/c1-3-13(2)24-9-15(7-21-24)19-18-4-5-20-26(18)10-17(23-19)14-6-22-25(8-14)16(11-27)12-28/h4-10,13,16,27-28H,3,11-12H2,1-2H3/t13-/m0/s1
Reactome pathway
US Patent
n/an/a 5.50E+3n/an/an/an/an/an/a
Array BioPharma Inc.; Celgene Corporation
US Patent
Assay Description
Compounds of Formula I were screened for their ability to inhibit JAK3 using the general enzyme inhibition assay method, in which the assay mixture c...
US Patent US10730880 (2020)
Non-receptor tyrosine-protein kinase TYK2
(Homo sapiens (Human))
BDBM325422
((S)-2-(4-(4-(1-(sec- butyl)-1H-pyrazol-4- yl)pyraz...)
Show SMILES CC[C@H](C)n1cc(cn1)-c1nc(cn2nccc12)-c1cnn(c1)C(CO)CO |r|
Show InChI InChI=1S/C19H23N7O2/c1-3-13(2)24-9-15(7-21-24)19-18-4-5-20-26(18)10-17(23-19)14-6-22-25(8-14)16(11-27)12-28/h4-10,13,16,27-28H,3,11-12H2,1-2H3/t13-/m0/s1
US Patent
n/an/a 55n/an/an/an/an/an/a
ARRAY BIOPHARMA INC.; CELGENE CORPORATION
US Patent
Assay Description
Compounds of Formula I were screened for their ability to inhibit Tyk2 using the general enzyme inhibition assay method, in which the assay mixture c...
US Patent US11028093 (2021)
Tyrosine-protein kinase JAK1
(Homo sapiens (Human))
BDBM325422
((S)-2-(4-(4-(1-(sec- butyl)-1H-pyrazol-4- yl)pyraz...)
Show SMILES CC[C@H](C)n1cc(cn1)-c1nc(cn2nccc12)-c1cnn(c1)C(CO)CO |r|
Show InChI InChI=1S/C19H23N7O2/c1-3-13(2)24-9-15(7-21-24)19-18-4-5-20-26(18)10-17(23-19)14-6-22-25(8-14)16(11-27)12-28/h4-10,13,16,27-28H,3,11-12H2,1-2H3/t13-/m0/s1
Reactome pathway
US Patent
n/an/a 55n/an/an/an/an/an/a
ARRAY BIOPHARMA INC.; CELGENE CORPORATION
US Patent
Assay Description
Compounds of Formula I were screened for their ability to inhibit JAK1 using the general enzyme inhibition assay method, in which the assay mixture c...
US Patent US11028093 (2021)
Tyrosine-protein kinase JAK2
(Homo sapiens (Human))
BDBM325422
((S)-2-(4-(4-(1-(sec- butyl)-1H-pyrazol-4- yl)pyraz...)
Show SMILES CC[C@H](C)n1cc(cn1)-c1nc(cn2nccc12)-c1cnn(c1)C(CO)CO |r|
Show InChI InChI=1S/C19H23N7O2/c1-3-13(2)24-9-15(7-21-24)19-18-4-5-20-26(18)10-17(23-19)14-6-22-25(8-14)16(11-27)12-28/h4-10,13,16,27-28H,3,11-12H2,1-2H3/t13-/m0/s1
Reactome pathway
US Patent
n/an/a 55n/an/an/an/an/an/a
ARRAY BIOPHARMA INC.; CELGENE CORPORATION
US Patent
Assay Description
Compounds of Formula I were screened for their ability to inhibit JAK2 using the general enzyme inhibition assay method, in which the assay mixture c...
US Patent US11028093 (2021)
Tyrosine-protein kinase JAK1
(Homo sapiens (Human))
BDBM325422
((S)-2-(4-(4-(1-(sec- butyl)-1H-pyrazol-4- yl)pyraz...)
Show SMILES CC[C@H](C)n1cc(cn1)-c1nc(cn2nccc12)-c1cnn(c1)C(CO)CO |r|
Show InChI InChI=1S/C19H23N7O2/c1-3-13(2)24-9-15(7-21-24)19-18-4-5-20-26(18)10-17(23-19)14-6-22-25(8-14)16(11-27)12-28/h4-10,13,16,27-28H,3,11-12H2,1-2H3/t13-/m0/s1
Reactome pathway
US Patent
n/an/a 55n/an/an/an/an/an/a
Array BioPharma Inc.; Celgene Corporation
US Patent
Assay Description
Compounds of Formula I were screened for their ability to inhibit JAK1 using the general enzyme inhibition assay method, in which the assay mixture c...
US Patent US10730880 (2020)