BDBM325470 US10189845, Example 132A::US10189845, Example 133B::US10730880, Example 133
SMILES: CCC(CC)n1cc(cn1)-c1nc(cn2nccc12)-c1cnn(c1)[C@@H]1C[C@H](O)[C@H](O)C1
InChI Key: InChIKey=GBHCHXVAULPBEL-ZHPFXUNLSA-N
Data: 24 IC50
Activity Spreadsheet -- Enzyme Inhibition Constant Data from BindingDB
Found 24 hits for monomerid = 325470
Trg + Lig
Ki
nM
ΔG°
kcal/mole
IC50
nM
Kd
nM
EC50/IC50
nM
koff
s-1
kon
M-1s-1
pHTemp
°C
Non-receptor tyrosine-protein kinase TYK2
(Homo sapiens (Human))
BDBM325470
(US10189845, Example 132A | US10189845, Example 133...)
Show SMILES CCC(CC)n1cc(cn1)-c1nc(cn2nccc12)-c1cnn(c1)[C@@H]1C[C@H](O)[C@H](O)C1 |r|
Show InChI InChI=1S/C22H27N7O2/c1-3-16(4-2)27-12-15(10-25-27)22-19-5-6-23-29(19)13-18(26-22)14-9-24-28(11-14)17-7-20(30)21(31)8-17/h5-6,9-13,16-17,20-21,30-31H,3-4,7-8H2,1-2H3/t17-,20+,21-
US Patent
n/an/a 55n/an/an/an/an/an/a
Array BioPharma Inc.
US Patent
Assay Description
Compounds of Formula I were screened for their ability to inhibit Tyk2 using the general enzyme inhibition assay method, in which the assay mixture c...
US Patent US10189845 (2019)
BindingDB Entry DOI: 10.7270/Q2Z03B7Q
Tyrosine-protein kinase JAK3
(Homo sapiens (Human))
BDBM325470
(US10189845, Example 132A | US10189845, Example 133...)
Show SMILES CCC(CC)n1cc(cn1)-c1nc(cn2nccc12)-c1cnn(c1)[C@@H]1C[C@H](O)[C@H](O)C1 |r|
Show InChI InChI=1S/C22H27N7O2/c1-3-16(4-2)27-12-15(10-25-27)22-19-5-6-23-29(19)13-18(26-22)14-9-24-28(11-14)17-7-20(30)21(31)8-17/h5-6,9-13,16-17,20-21,30-31H,3-4,7-8H2,1-2H3/t17-,20+,21-
Reactome pathway
US Patent
n/an/a 5.50E+3n/an/an/an/an/an/a
ARRAY BIOPHARMA INC.; CELGENE CORPORATION
US Patent
Assay Description
Compounds of Formula I were screened for their ability to inhibit JAK3 using the general enzyme inhibition assay method, in which the assay mixture c...
US Patent US11028093 (2021)
Tyrosine-protein kinase JAK2
(Homo sapiens (Human))
BDBM325470
(US10189845, Example 132A | US10189845, Example 133...)
Show SMILES CCC(CC)n1cc(cn1)-c1nc(cn2nccc12)-c1cnn(c1)[C@@H]1C[C@H](O)[C@H](O)C1 |r|
Show InChI InChI=1S/C22H27N7O2/c1-3-16(4-2)27-12-15(10-25-27)22-19-5-6-23-29(19)13-18(26-22)14-9-24-28(11-14)17-7-20(30)21(31)8-17/h5-6,9-13,16-17,20-21,30-31H,3-4,7-8H2,1-2H3/t17-,20+,21-
Reactome pathway
US Patent
n/an/a<10n/an/an/an/an/an/a
Array BioPharma Inc.
US Patent
Assay Description
Compounds of Formula I were screened for their ability to inhibit JAK2 using the general enzyme inhibition assay method, in which the assay mixture c...
US Patent US10189845 (2019)
BindingDB Entry DOI: 10.7270/Q2Z03B7Q
Tyrosine-protein kinase JAK3
(Homo sapiens (Human))
BDBM325470
(US10189845, Example 132A | US10189845, Example 133...)
Show SMILES CCC(CC)n1cc(cn1)-c1nc(cn2nccc12)-c1cnn(c1)[C@@H]1C[C@H](O)[C@H](O)C1 |r|
Show InChI InChI=1S/C22H27N7O2/c1-3-16(4-2)27-12-15(10-25-27)22-19-5-6-23-29(19)13-18(26-22)14-9-24-28(11-14)17-7-20(30)21(31)8-17/h5-6,9-13,16-17,20-21,30-31H,3-4,7-8H2,1-2H3/t17-,20+,21-
Reactome pathway
US Patent
n/an/a 5.50E+3n/an/an/an/an/an/a
Array BioPharma Inc.
US Patent
Assay Description
Compounds of Formula I were screened for their ability to inhibit JAK3 using the general enzyme inhibition assay method, in which the assay mixture c...
US Patent US10189845 (2019)
BindingDB Entry DOI: 10.7270/Q2Z03B7Q
Non-receptor tyrosine-protein kinase TYK2
(Homo sapiens (Human))
BDBM325470
(US10189845, Example 132A | US10189845, Example 133...)
Show SMILES CCC(CC)n1cc(cn1)-c1nc(cn2nccc12)-c1cnn(c1)[C@@H]1C[C@H](O)[C@H](O)C1 |r|
Show InChI InChI=1S/C22H27N7O2/c1-3-16(4-2)27-12-15(10-25-27)22-19-5-6-23-29(19)13-18(26-22)14-9-24-28(11-14)17-7-20(30)21(31)8-17/h5-6,9-13,16-17,20-21,30-31H,3-4,7-8H2,1-2H3/t17-,20+,21-
US Patent
n/an/a 55n/an/an/an/an/an/a
Array BioPharma Inc.
US Patent
Assay Description
Compounds of Formula I were screened for their ability to inhibit Tyk2 using the general enzyme inhibition assay method, in which the assay mixture c...
US Patent US10189845 (2019)
BindingDB Entry DOI: 10.7270/Q2Z03B7Q
Tyrosine-protein kinase JAK1
(Homo sapiens (Human))
BDBM325470
(US10189845, Example 132A | US10189845, Example 133...)
Show SMILES CCC(CC)n1cc(cn1)-c1nc(cn2nccc12)-c1cnn(c1)[C@@H]1C[C@H](O)[C@H](O)C1 |r|
Show InChI InChI=1S/C22H27N7O2/c1-3-16(4-2)27-12-15(10-25-27)22-19-5-6-23-29(19)13-18(26-22)14-9-24-28(11-14)17-7-20(30)21(31)8-17/h5-6,9-13,16-17,20-21,30-31H,3-4,7-8H2,1-2H3/t17-,20+,21-
Reactome pathway
US Patent
n/an/a 55n/an/an/an/an/an/a
Array BioPharma Inc.
US Patent
Assay Description
Compounds of Formula I were screened for their ability to inhibit JAK1 using the general enzyme inhibition assay method, in which the assay mixture c...
US Patent US10189845 (2019)
BindingDB Entry DOI: 10.7270/Q2Z03B7Q
Tyrosine-protein kinase JAK2
(Homo sapiens (Human))
BDBM325470
(US10189845, Example 132A | US10189845, Example 133...)
Show SMILES CCC(CC)n1cc(cn1)-c1nc(cn2nccc12)-c1cnn(c1)[C@@H]1C[C@H](O)[C@H](O)C1 |r|
Show InChI InChI=1S/C22H27N7O2/c1-3-16(4-2)27-12-15(10-25-27)22-19-5-6-23-29(19)13-18(26-22)14-9-24-28(11-14)17-7-20(30)21(31)8-17/h5-6,9-13,16-17,20-21,30-31H,3-4,7-8H2,1-2H3/t17-,20+,21-
Reactome pathway
US Patent
n/an/a 55n/an/an/an/an/an/a
Array BioPharma Inc.
US Patent
Assay Description
Compounds of Formula I were screened for their ability to inhibit JAK2 using the general enzyme inhibition assay method, in which the assay mixture c...
US Patent US10189845 (2019)
BindingDB Entry DOI: 10.7270/Q2Z03B7Q
Tyrosine-protein kinase JAK3
(Homo sapiens (Human))
BDBM325470
(US10189845, Example 132A | US10189845, Example 133...)
Show SMILES CCC(CC)n1cc(cn1)-c1nc(cn2nccc12)-c1cnn(c1)[C@@H]1C[C@H](O)[C@H](O)C1 |r|
Show InChI InChI=1S/C22H27N7O2/c1-3-16(4-2)27-12-15(10-25-27)22-19-5-6-23-29(19)13-18(26-22)14-9-24-28(11-14)17-7-20(30)21(31)8-17/h5-6,9-13,16-17,20-21,30-31H,3-4,7-8H2,1-2H3/t17-,20+,21-
Reactome pathway
US Patent
n/an/a 5.50E+3n/an/an/an/an/an/a
Array BioPharma Inc.
US Patent
Assay Description
Compounds of Formula I were screened for their ability to inhibit JAK3 using the general enzyme inhibition assay method, in which the assay mixture c...
US Patent US10189845 (2019)
BindingDB Entry DOI: 10.7270/Q2Z03B7Q
Non-receptor tyrosine-protein kinase TYK2
(Homo sapiens (Human))
BDBM325470
(US10189845, Example 132A | US10189845, Example 133...)
Show SMILES CCC(CC)n1cc(cn1)-c1nc(cn2nccc12)-c1cnn(c1)[C@@H]1C[C@H](O)[C@H](O)C1 |r|
Show InChI InChI=1S/C22H27N7O2/c1-3-16(4-2)27-12-15(10-25-27)22-19-5-6-23-29(19)13-18(26-22)14-9-24-28(11-14)17-7-20(30)21(31)8-17/h5-6,9-13,16-17,20-21,30-31H,3-4,7-8H2,1-2H3/t17-,20+,21-
US Patent
n/an/a 55n/an/an/an/an/an/a
Array BioPharma Inc.; Celgene Corporation
US Patent
Assay Description
Compounds of Formula I were screened for their ability to inhibit Tyk2 using the general enzyme inhibition assay method, in which the assay mixture c...
US Patent US10730880 (2020)
Tyrosine-protein kinase JAK1
(Homo sapiens (Human))
BDBM325470
(US10189845, Example 132A | US10189845, Example 133...)
Show SMILES CCC(CC)n1cc(cn1)-c1nc(cn2nccc12)-c1cnn(c1)[C@@H]1C[C@H](O)[C@H](O)C1 |r|
Show InChI InChI=1S/C22H27N7O2/c1-3-16(4-2)27-12-15(10-25-27)22-19-5-6-23-29(19)13-18(26-22)14-9-24-28(11-14)17-7-20(30)21(31)8-17/h5-6,9-13,16-17,20-21,30-31H,3-4,7-8H2,1-2H3/t17-,20+,21-
Reactome pathway
US Patent
n/an/a 550n/an/an/an/an/an/a
Array BioPharma Inc.; Celgene Corporation
US Patent
Assay Description
Compounds of Formula I were screened for their ability to inhibit JAK1 using the general enzyme inhibition assay method, in which the assay mixture c...
US Patent US10730880 (2020)
Tyrosine-protein kinase JAK2
(Homo sapiens (Human))
BDBM325470
(US10189845, Example 132A | US10189845, Example 133...)
Show SMILES CCC(CC)n1cc(cn1)-c1nc(cn2nccc12)-c1cnn(c1)[C@@H]1C[C@H](O)[C@H](O)C1 |r|
Show InChI InChI=1S/C22H27N7O2/c1-3-16(4-2)27-12-15(10-25-27)22-19-5-6-23-29(19)13-18(26-22)14-9-24-28(11-14)17-7-20(30)21(31)8-17/h5-6,9-13,16-17,20-21,30-31H,3-4,7-8H2,1-2H3/t17-,20+,21-
Reactome pathway
US Patent
n/an/a 55n/an/an/an/an/an/a
Array BioPharma Inc.; Celgene Corporation
US Patent
Assay Description
Compounds of Formula I were screened for their ability to inhibit JAK2 using the general enzyme inhibition assay method, in which the assay mixture c...
US Patent US10730880 (2020)
Tyrosine-protein kinase JAK3
(Homo sapiens (Human))
BDBM325470
(US10189845, Example 132A | US10189845, Example 133...)
Show SMILES CCC(CC)n1cc(cn1)-c1nc(cn2nccc12)-c1cnn(c1)[C@@H]1C[C@H](O)[C@H](O)C1 |r|
Show InChI InChI=1S/C22H27N7O2/c1-3-16(4-2)27-12-15(10-25-27)22-19-5-6-23-29(19)13-18(26-22)14-9-24-28(11-14)17-7-20(30)21(31)8-17/h5-6,9-13,16-17,20-21,30-31H,3-4,7-8H2,1-2H3/t17-,20+,21-
Reactome pathway
US Patent
n/an/a 5.50E+3n/an/an/an/an/an/a
Array BioPharma Inc.; Celgene Corporation
US Patent
Assay Description
Compounds of Formula I were screened for their ability to inhibit JAK3 using the general enzyme inhibition assay method, in which the assay mixture c...
US Patent US10730880 (2020)
Non-receptor tyrosine-protein kinase TYK2
(Homo sapiens (Human))
BDBM325470
(US10189845, Example 132A | US10189845, Example 133...)
Show SMILES CCC(CC)n1cc(cn1)-c1nc(cn2nccc12)-c1cnn(c1)[C@@H]1C[C@H](O)[C@H](O)C1 |r|
Show InChI InChI=1S/C22H27N7O2/c1-3-16(4-2)27-12-15(10-25-27)22-19-5-6-23-29(19)13-18(26-22)14-9-24-28(11-14)17-7-20(30)21(31)8-17/h5-6,9-13,16-17,20-21,30-31H,3-4,7-8H2,1-2H3/t17-,20+,21-
US Patent
n/an/a 55n/an/an/an/an/an/a
Array BioPharma Inc.; Celgene Corporation
US Patent
Assay Description
Compounds of Formula I were screened for their ability to inhibit Tyk2 using the general enzyme inhibition assay method, in which the assay mixture c...
US Patent US10730880 (2020)
Tyrosine-protein kinase JAK1
(Homo sapiens (Human))
BDBM325470
(US10189845, Example 132A | US10189845, Example 133...)
Show SMILES CCC(CC)n1cc(cn1)-c1nc(cn2nccc12)-c1cnn(c1)[C@@H]1C[C@H](O)[C@H](O)C1 |r|
Show InChI InChI=1S/C22H27N7O2/c1-3-16(4-2)27-12-15(10-25-27)22-19-5-6-23-29(19)13-18(26-22)14-9-24-28(11-14)17-7-20(30)21(31)8-17/h5-6,9-13,16-17,20-21,30-31H,3-4,7-8H2,1-2H3/t17-,20+,21-
Reactome pathway
US Patent
n/an/a 55n/an/an/an/an/an/a
Array BioPharma Inc.; Celgene Corporation
US Patent
Assay Description
Compounds of Formula I were screened for their ability to inhibit JAK1 using the general enzyme inhibition assay method, in which the assay mixture c...
US Patent US10730880 (2020)
Tyrosine-protein kinase JAK2
(Homo sapiens (Human))
BDBM325470
(US10189845, Example 132A | US10189845, Example 133...)
Show SMILES CCC(CC)n1cc(cn1)-c1nc(cn2nccc12)-c1cnn(c1)[C@@H]1C[C@H](O)[C@H](O)C1 |r|
Show InChI InChI=1S/C22H27N7O2/c1-3-16(4-2)27-12-15(10-25-27)22-19-5-6-23-29(19)13-18(26-22)14-9-24-28(11-14)17-7-20(30)21(31)8-17/h5-6,9-13,16-17,20-21,30-31H,3-4,7-8H2,1-2H3/t17-,20+,21-
Reactome pathway
US Patent
n/an/a<10n/an/an/an/an/an/a
Array BioPharma Inc.; Celgene Corporation
US Patent
Assay Description
Compounds of Formula I were screened for their ability to inhibit JAK2 using the general enzyme inhibition assay method, in which the assay mixture c...
US Patent US10730880 (2020)
Tyrosine-protein kinase JAK3
(Homo sapiens (Human))
BDBM325470
(US10189845, Example 132A | US10189845, Example 133...)
Show SMILES CCC(CC)n1cc(cn1)-c1nc(cn2nccc12)-c1cnn(c1)[C@@H]1C[C@H](O)[C@H](O)C1 |r|
Show InChI InChI=1S/C22H27N7O2/c1-3-16(4-2)27-12-15(10-25-27)22-19-5-6-23-29(19)13-18(26-22)14-9-24-28(11-14)17-7-20(30)21(31)8-17/h5-6,9-13,16-17,20-21,30-31H,3-4,7-8H2,1-2H3/t17-,20+,21-
Reactome pathway
US Patent
n/an/a 5.50E+3n/an/an/an/an/an/a
Array BioPharma Inc.; Celgene Corporation
US Patent
Assay Description
Compounds of Formula I were screened for their ability to inhibit JAK3 using the general enzyme inhibition assay method, in which the assay mixture c...
US Patent US10730880 (2020)
Non-receptor tyrosine-protein kinase TYK2
(Homo sapiens (Human))
BDBM325470
(US10189845, Example 132A | US10189845, Example 133...)
Show SMILES CCC(CC)n1cc(cn1)-c1nc(cn2nccc12)-c1cnn(c1)[C@@H]1C[C@H](O)[C@H](O)C1 |r|
Show InChI InChI=1S/C22H27N7O2/c1-3-16(4-2)27-12-15(10-25-27)22-19-5-6-23-29(19)13-18(26-22)14-9-24-28(11-14)17-7-20(30)21(31)8-17/h5-6,9-13,16-17,20-21,30-31H,3-4,7-8H2,1-2H3/t17-,20+,21-
US Patent
n/an/a 55n/an/an/an/an/an/a
ARRAY BIOPHARMA INC.; CELGENE CORPORATION
US Patent
Assay Description
Compounds of Formula I were screened for their ability to inhibit Tyk2 using the general enzyme inhibition assay method, in which the assay mixture c...
US Patent US11028093 (2021)
Tyrosine-protein kinase JAK1
(Homo sapiens (Human))
BDBM325470
(US10189845, Example 132A | US10189845, Example 133...)
Show SMILES CCC(CC)n1cc(cn1)-c1nc(cn2nccc12)-c1cnn(c1)[C@@H]1C[C@H](O)[C@H](O)C1 |r|
Show InChI InChI=1S/C22H27N7O2/c1-3-16(4-2)27-12-15(10-25-27)22-19-5-6-23-29(19)13-18(26-22)14-9-24-28(11-14)17-7-20(30)21(31)8-17/h5-6,9-13,16-17,20-21,30-31H,3-4,7-8H2,1-2H3/t17-,20+,21-
Reactome pathway
US Patent
n/an/a 550n/an/an/an/an/an/a
ARRAY BIOPHARMA INC.; CELGENE CORPORATION
US Patent
Assay Description
Compounds of Formula I were screened for their ability to inhibit JAK1 using the general enzyme inhibition assay method, in which the assay mixture c...
US Patent US11028093 (2021)
Tyrosine-protein kinase JAK2
(Homo sapiens (Human))
BDBM325470
(US10189845, Example 132A | US10189845, Example 133...)
Show SMILES CCC(CC)n1cc(cn1)-c1nc(cn2nccc12)-c1cnn(c1)[C@@H]1C[C@H](O)[C@H](O)C1 |r|
Show InChI InChI=1S/C22H27N7O2/c1-3-16(4-2)27-12-15(10-25-27)22-19-5-6-23-29(19)13-18(26-22)14-9-24-28(11-14)17-7-20(30)21(31)8-17/h5-6,9-13,16-17,20-21,30-31H,3-4,7-8H2,1-2H3/t17-,20+,21-
Reactome pathway
US Patent
n/an/a 55n/an/an/an/an/an/a
ARRAY BIOPHARMA INC.; CELGENE CORPORATION
US Patent
Assay Description
Compounds of Formula I were screened for their ability to inhibit JAK2 using the general enzyme inhibition assay method, in which the assay mixture c...
US Patent US11028093 (2021)
Tyrosine-protein kinase JAK3
(Homo sapiens (Human))
BDBM325470
(US10189845, Example 132A | US10189845, Example 133...)
Show SMILES CCC(CC)n1cc(cn1)-c1nc(cn2nccc12)-c1cnn(c1)[C@@H]1C[C@H](O)[C@H](O)C1 |r|
Show InChI InChI=1S/C22H27N7O2/c1-3-16(4-2)27-12-15(10-25-27)22-19-5-6-23-29(19)13-18(26-22)14-9-24-28(11-14)17-7-20(30)21(31)8-17/h5-6,9-13,16-17,20-21,30-31H,3-4,7-8H2,1-2H3/t17-,20+,21-
Reactome pathway
US Patent
n/an/a 5.50E+3n/an/an/an/an/an/a
ARRAY BIOPHARMA INC.; CELGENE CORPORATION
US Patent
Assay Description
Compounds of Formula I were screened for their ability to inhibit JAK3 using the general enzyme inhibition assay method, in which the assay mixture c...
US Patent US11028093 (2021)
Non-receptor tyrosine-protein kinase TYK2
(Homo sapiens (Human))
BDBM325470
(US10189845, Example 132A | US10189845, Example 133...)
Show SMILES CCC(CC)n1cc(cn1)-c1nc(cn2nccc12)-c1cnn(c1)[C@@H]1C[C@H](O)[C@H](O)C1 |r|
Show InChI InChI=1S/C22H27N7O2/c1-3-16(4-2)27-12-15(10-25-27)22-19-5-6-23-29(19)13-18(26-22)14-9-24-28(11-14)17-7-20(30)21(31)8-17/h5-6,9-13,16-17,20-21,30-31H,3-4,7-8H2,1-2H3/t17-,20+,21-
US Patent
n/an/a 55n/an/an/an/an/an/a
ARRAY BIOPHARMA INC.; CELGENE CORPORATION
US Patent
Assay Description
Compounds of Formula I were screened for their ability to inhibit Tyk2 using the general enzyme inhibition assay method, in which the assay mixture c...
US Patent US11028093 (2021)
Tyrosine-protein kinase JAK1
(Homo sapiens (Human))
BDBM325470
(US10189845, Example 132A | US10189845, Example 133...)
Show SMILES CCC(CC)n1cc(cn1)-c1nc(cn2nccc12)-c1cnn(c1)[C@@H]1C[C@H](O)[C@H](O)C1 |r|
Show InChI InChI=1S/C22H27N7O2/c1-3-16(4-2)27-12-15(10-25-27)22-19-5-6-23-29(19)13-18(26-22)14-9-24-28(11-14)17-7-20(30)21(31)8-17/h5-6,9-13,16-17,20-21,30-31H,3-4,7-8H2,1-2H3/t17-,20+,21-
Reactome pathway
US Patent
n/an/a 55n/an/an/an/an/an/a
ARRAY BIOPHARMA INC.; CELGENE CORPORATION
US Patent
Assay Description
Compounds of Formula I were screened for their ability to inhibit JAK1 using the general enzyme inhibition assay method, in which the assay mixture c...
US Patent US11028093 (2021)
Tyrosine-protein kinase JAK2
(Homo sapiens (Human))
BDBM325470
(US10189845, Example 132A | US10189845, Example 133...)
Show SMILES CCC(CC)n1cc(cn1)-c1nc(cn2nccc12)-c1cnn(c1)[C@@H]1C[C@H](O)[C@H](O)C1 |r|
Show InChI InChI=1S/C22H27N7O2/c1-3-16(4-2)27-12-15(10-25-27)22-19-5-6-23-29(19)13-18(26-22)14-9-24-28(11-14)17-7-20(30)21(31)8-17/h5-6,9-13,16-17,20-21,30-31H,3-4,7-8H2,1-2H3/t17-,20+,21-
Reactome pathway
US Patent
n/an/a<10n/an/an/an/an/an/a
ARRAY BIOPHARMA INC.; CELGENE CORPORATION
US Patent
Assay Description
Compounds of Formula I were screened for their ability to inhibit JAK2 using the general enzyme inhibition assay method, in which the assay mixture c...
US Patent US11028093 (2021)
Tyrosine-protein kinase JAK1
(Homo sapiens (Human))
BDBM325470
(US10189845, Example 132A | US10189845, Example 133...)
Show SMILES CCC(CC)n1cc(cn1)-c1nc(cn2nccc12)-c1cnn(c1)[C@@H]1C[C@H](O)[C@H](O)C1 |r|
Show InChI InChI=1S/C22H27N7O2/c1-3-16(4-2)27-12-15(10-25-27)22-19-5-6-23-29(19)13-18(26-22)14-9-24-28(11-14)17-7-20(30)21(31)8-17/h5-6,9-13,16-17,20-21,30-31H,3-4,7-8H2,1-2H3/t17-,20+,21-
Reactome pathway
US Patent
n/an/a 55n/an/an/an/an/an/a
Array BioPharma Inc.
US Patent
Assay Description
Compounds of Formula I were screened for their ability to inhibit JAK1 using the general enzyme inhibition assay method, in which the assay mixture c...
US Patent US10189845 (2019)
BindingDB Entry DOI: 10.7270/Q2Z03B7Q