BDBM325500 (1s,3s)-1-methyl-3-(4-(4-(1-(pentan-3-yl)-1H-pyrazol-4-yl)pyrazolo[1,5-a]pyrazin-6-yl)-1H-pyrazol-1-yl)cyclobutanol::US10189845, Example 162::US10730880, Example 162
SMILES: CCC(CC)n1cc(cn1)-c1nc(cn2nccc12)-c1cnn(c1)C1C[C@@](C)(O)C1
InChI Key: InChIKey=GQMPILIYOVYDCB-ODSWDVDOSA-N
Data: 8 IC50
Activity Spreadsheet -- Enzyme Inhibition Constant Data from BindingDB
Found 8 hits for monomerid = 325500
Trg + Lig
Ki
nM
ΔG°
kcal/mole
IC50
nM
Kd
nM
EC50/IC50
nM
koff
s-1
kon
M-1s-1
pHTemp
°C
Non-receptor tyrosine-protein kinase TYK2
(Homo sapiens (Human))
BDBM325500
((1s,3s)-1-methyl-3-(4-(4-(1-(pentan-3-yl)-1H-pyraz...)
Show SMILES CCC(CC)n1cc(cn1)-c1nc(cn2nccc12)-c1cnn(c1)C1C[C@@](C)(O)C1 |r,wU:26.31,wD:26.30,(.46,9.04,;-.31,7.71,;.46,6.38,;2,6.38,;2.77,7.71,;-.31,5.04,;.17,3.58,;-1.08,2.67,;-2.33,3.58,;-1.85,5.04,;-1.08,1.13,;.25,.36,;.25,-1.18,;-1.08,-1.95,;-2.41,-1.18,;-3.88,-1.65,;-4.78,-.41,;-3.88,.84,;-2.41,.36,;1.59,-1.95,;3.05,-1.47,;3.96,-2.72,;3.05,-3.96,;1.59,-3.49,;3.45,-5.45,;4.78,-6.22,;4.01,-7.56,;3.24,-8.89,;4.41,-9.04,;2.68,-6.79,)|
Show InChI InChI=1S/C22H27N7O/c1-4-17(5-2)27-13-16(11-25-27)21-20-6-7-23-29(20)14-19(26-21)15-10-24-28(12-15)18-8-22(3,30)9-18/h6-7,10-14,17-18,30H,4-5,8-9H2,1-3H3/t18?,22-
US Patent
n/an/a 55n/an/an/an/an/an/a
Array BioPharma Inc.
US Patent
Assay Description
Compounds of Formula I were screened for their ability to inhibit Tyk2 using the general enzyme inhibition assay method, in which the assay mixture c...
US Patent US10189845 (2019)
BindingDB Entry DOI: 10.7270/Q2Z03B7Q
Tyrosine-protein kinase JAK1
(Homo sapiens (Human))
BDBM325500
((1s,3s)-1-methyl-3-(4-(4-(1-(pentan-3-yl)-1H-pyraz...)
Show SMILES CCC(CC)n1cc(cn1)-c1nc(cn2nccc12)-c1cnn(c1)C1C[C@@](C)(O)C1 |r,wU:26.31,wD:26.30,(.46,9.04,;-.31,7.71,;.46,6.38,;2,6.38,;2.77,7.71,;-.31,5.04,;.17,3.58,;-1.08,2.67,;-2.33,3.58,;-1.85,5.04,;-1.08,1.13,;.25,.36,;.25,-1.18,;-1.08,-1.95,;-2.41,-1.18,;-3.88,-1.65,;-4.78,-.41,;-3.88,.84,;-2.41,.36,;1.59,-1.95,;3.05,-1.47,;3.96,-2.72,;3.05,-3.96,;1.59,-3.49,;3.45,-5.45,;4.78,-6.22,;4.01,-7.56,;3.24,-8.89,;4.41,-9.04,;2.68,-6.79,)|
Show InChI InChI=1S/C22H27N7O/c1-4-17(5-2)27-13-16(11-25-27)21-20-6-7-23-29(20)14-19(26-21)15-10-24-28(12-15)18-8-22(3,30)9-18/h6-7,10-14,17-18,30H,4-5,8-9H2,1-3H3/t18?,22-
Reactome pathway
US Patent
n/an/a 550n/an/an/an/an/an/a
Array BioPharma Inc.
US Patent
Assay Description
Compounds of Formula I were screened for their ability to inhibit JAK1 using the general enzyme inhibition assay method, in which the assay mixture c...
US Patent US10189845 (2019)
BindingDB Entry DOI: 10.7270/Q2Z03B7Q
Tyrosine-protein kinase JAK2
(Homo sapiens (Human))
BDBM325500
((1s,3s)-1-methyl-3-(4-(4-(1-(pentan-3-yl)-1H-pyraz...)
Show SMILES CCC(CC)n1cc(cn1)-c1nc(cn2nccc12)-c1cnn(c1)C1C[C@@](C)(O)C1 |r,wU:26.31,wD:26.30,(.46,9.04,;-.31,7.71,;.46,6.38,;2,6.38,;2.77,7.71,;-.31,5.04,;.17,3.58,;-1.08,2.67,;-2.33,3.58,;-1.85,5.04,;-1.08,1.13,;.25,.36,;.25,-1.18,;-1.08,-1.95,;-2.41,-1.18,;-3.88,-1.65,;-4.78,-.41,;-3.88,.84,;-2.41,.36,;1.59,-1.95,;3.05,-1.47,;3.96,-2.72,;3.05,-3.96,;1.59,-3.49,;3.45,-5.45,;4.78,-6.22,;4.01,-7.56,;3.24,-8.89,;4.41,-9.04,;2.68,-6.79,)|
Show InChI InChI=1S/C22H27N7O/c1-4-17(5-2)27-13-16(11-25-27)21-20-6-7-23-29(20)14-19(26-21)15-10-24-28(12-15)18-8-22(3,30)9-18/h6-7,10-14,17-18,30H,4-5,8-9H2,1-3H3/t18?,22-
Reactome pathway
US Patent
n/an/a<10n/an/an/an/an/an/a
Array BioPharma Inc.
US Patent
Assay Description
Compounds of Formula I were screened for their ability to inhibit JAK2 using the general enzyme inhibition assay method, in which the assay mixture c...
US Patent US10189845 (2019)
BindingDB Entry DOI: 10.7270/Q2Z03B7Q
Tyrosine-protein kinase JAK3
(Homo sapiens (Human))
BDBM325500
((1s,3s)-1-methyl-3-(4-(4-(1-(pentan-3-yl)-1H-pyraz...)
Show SMILES CCC(CC)n1cc(cn1)-c1nc(cn2nccc12)-c1cnn(c1)C1C[C@@](C)(O)C1 |r,wU:26.31,wD:26.30,(.46,9.04,;-.31,7.71,;.46,6.38,;2,6.38,;2.77,7.71,;-.31,5.04,;.17,3.58,;-1.08,2.67,;-2.33,3.58,;-1.85,5.04,;-1.08,1.13,;.25,.36,;.25,-1.18,;-1.08,-1.95,;-2.41,-1.18,;-3.88,-1.65,;-4.78,-.41,;-3.88,.84,;-2.41,.36,;1.59,-1.95,;3.05,-1.47,;3.96,-2.72,;3.05,-3.96,;1.59,-3.49,;3.45,-5.45,;4.78,-6.22,;4.01,-7.56,;3.24,-8.89,;4.41,-9.04,;2.68,-6.79,)|
Show InChI InChI=1S/C22H27N7O/c1-4-17(5-2)27-13-16(11-25-27)21-20-6-7-23-29(20)14-19(26-21)15-10-24-28(12-15)18-8-22(3,30)9-18/h6-7,10-14,17-18,30H,4-5,8-9H2,1-3H3/t18?,22-
Reactome pathway
US Patent
n/an/a 5.50E+3n/an/an/an/an/an/a
Array BioPharma Inc.; Celgene Corporation
US Patent
Assay Description
Compounds of Formula I were screened for their ability to inhibit JAK3 using the general enzyme inhibition assay method, in which the assay mixture c...
US Patent US10730880 (2020)
Non-receptor tyrosine-protein kinase TYK2
(Homo sapiens (Human))
BDBM325500
((1s,3s)-1-methyl-3-(4-(4-(1-(pentan-3-yl)-1H-pyraz...)
Show SMILES CCC(CC)n1cc(cn1)-c1nc(cn2nccc12)-c1cnn(c1)C1C[C@@](C)(O)C1 |r,wU:26.31,wD:26.30,(.46,9.04,;-.31,7.71,;.46,6.38,;2,6.38,;2.77,7.71,;-.31,5.04,;.17,3.58,;-1.08,2.67,;-2.33,3.58,;-1.85,5.04,;-1.08,1.13,;.25,.36,;.25,-1.18,;-1.08,-1.95,;-2.41,-1.18,;-3.88,-1.65,;-4.78,-.41,;-3.88,.84,;-2.41,.36,;1.59,-1.95,;3.05,-1.47,;3.96,-2.72,;3.05,-3.96,;1.59,-3.49,;3.45,-5.45,;4.78,-6.22,;4.01,-7.56,;3.24,-8.89,;4.41,-9.04,;2.68,-6.79,)|
Show InChI InChI=1S/C22H27N7O/c1-4-17(5-2)27-13-16(11-25-27)21-20-6-7-23-29(20)14-19(26-21)15-10-24-28(12-15)18-8-22(3,30)9-18/h6-7,10-14,17-18,30H,4-5,8-9H2,1-3H3/t18?,22-
US Patent
n/an/a<10n/an/an/an/an/an/a
Array BioPharma Inc.; Celgene Corporation
US Patent
Assay Description
Compounds of Formula I were screened for their ability to inhibit Tyk2 using the general enzyme inhibition assay method, in which the assay mixture c...
US Patent US10730880 (2020)
Tyrosine-protein kinase JAK1
(Homo sapiens (Human))
BDBM325500
((1s,3s)-1-methyl-3-(4-(4-(1-(pentan-3-yl)-1H-pyraz...)
Show SMILES CCC(CC)n1cc(cn1)-c1nc(cn2nccc12)-c1cnn(c1)C1C[C@@](C)(O)C1 |r,wU:26.31,wD:26.30,(.46,9.04,;-.31,7.71,;.46,6.38,;2,6.38,;2.77,7.71,;-.31,5.04,;.17,3.58,;-1.08,2.67,;-2.33,3.58,;-1.85,5.04,;-1.08,1.13,;.25,.36,;.25,-1.18,;-1.08,-1.95,;-2.41,-1.18,;-3.88,-1.65,;-4.78,-.41,;-3.88,.84,;-2.41,.36,;1.59,-1.95,;3.05,-1.47,;3.96,-2.72,;3.05,-3.96,;1.59,-3.49,;3.45,-5.45,;4.78,-6.22,;4.01,-7.56,;3.24,-8.89,;4.41,-9.04,;2.68,-6.79,)|
Show InChI InChI=1S/C22H27N7O/c1-4-17(5-2)27-13-16(11-25-27)21-20-6-7-23-29(20)14-19(26-21)15-10-24-28(12-15)18-8-22(3,30)9-18/h6-7,10-14,17-18,30H,4-5,8-9H2,1-3H3/t18?,22-
Reactome pathway
US Patent
n/an/a 550n/an/an/an/an/an/a
Array BioPharma Inc.; Celgene Corporation
US Patent
Assay Description
Compounds of Formula I were screened for their ability to inhibit JAK1 using the general enzyme inhibition assay method, in which the assay mixture c...
US Patent US10730880 (2020)
Tyrosine-protein kinase JAK2
(Homo sapiens (Human))
BDBM325500
((1s,3s)-1-methyl-3-(4-(4-(1-(pentan-3-yl)-1H-pyraz...)
Show SMILES CCC(CC)n1cc(cn1)-c1nc(cn2nccc12)-c1cnn(c1)C1C[C@@](C)(O)C1 |r,wU:26.31,wD:26.30,(.46,9.04,;-.31,7.71,;.46,6.38,;2,6.38,;2.77,7.71,;-.31,5.04,;.17,3.58,;-1.08,2.67,;-2.33,3.58,;-1.85,5.04,;-1.08,1.13,;.25,.36,;.25,-1.18,;-1.08,-1.95,;-2.41,-1.18,;-3.88,-1.65,;-4.78,-.41,;-3.88,.84,;-2.41,.36,;1.59,-1.95,;3.05,-1.47,;3.96,-2.72,;3.05,-3.96,;1.59,-3.49,;3.45,-5.45,;4.78,-6.22,;4.01,-7.56,;3.24,-8.89,;4.41,-9.04,;2.68,-6.79,)|
Show InChI InChI=1S/C22H27N7O/c1-4-17(5-2)27-13-16(11-25-27)21-20-6-7-23-29(20)14-19(26-21)15-10-24-28(12-15)18-8-22(3,30)9-18/h6-7,10-14,17-18,30H,4-5,8-9H2,1-3H3/t18?,22-
Reactome pathway
US Patent
n/an/a 55n/an/an/an/an/an/a
Array BioPharma Inc.; Celgene Corporation
US Patent
Assay Description
Compounds of Formula I were screened for their ability to inhibit JAK2 using the general enzyme inhibition assay method, in which the assay mixture c...
US Patent US10730880 (2020)
Tyrosine-protein kinase JAK3
(Homo sapiens (Human))
BDBM325500
((1s,3s)-1-methyl-3-(4-(4-(1-(pentan-3-yl)-1H-pyraz...)
Show SMILES CCC(CC)n1cc(cn1)-c1nc(cn2nccc12)-c1cnn(c1)C1C[C@@](C)(O)C1 |r,wU:26.31,wD:26.30,(.46,9.04,;-.31,7.71,;.46,6.38,;2,6.38,;2.77,7.71,;-.31,5.04,;.17,3.58,;-1.08,2.67,;-2.33,3.58,;-1.85,5.04,;-1.08,1.13,;.25,.36,;.25,-1.18,;-1.08,-1.95,;-2.41,-1.18,;-3.88,-1.65,;-4.78,-.41,;-3.88,.84,;-2.41,.36,;1.59,-1.95,;3.05,-1.47,;3.96,-2.72,;3.05,-3.96,;1.59,-3.49,;3.45,-5.45,;4.78,-6.22,;4.01,-7.56,;3.24,-8.89,;4.41,-9.04,;2.68,-6.79,)|
Show InChI InChI=1S/C22H27N7O/c1-4-17(5-2)27-13-16(11-25-27)21-20-6-7-23-29(20)14-19(26-21)15-10-24-28(12-15)18-8-22(3,30)9-18/h6-7,10-14,17-18,30H,4-5,8-9H2,1-3H3/t18?,22-
Reactome pathway
US Patent
n/an/a 5.50E+3n/an/an/an/an/an/a
Array BioPharma Inc.
US Patent
Assay Description
Compounds of Formula I were screened for their ability to inhibit JAK3 using the general enzyme inhibition assay method, in which the assay mixture c...
US Patent US10189845 (2019)
BindingDB Entry DOI: 10.7270/Q2Z03B7Q