BDBM32639 amino-oxazole, 2
SMILES: Nc1ncc(o1)C(=O)c1cccc(Br)c1
InChI Key: InChIKey=YDCMMVTWXORJGO-UHFFFAOYSA-N
Data: 1 IC50
PDB links: 1 PDB ID matches this monomer.
Activity Spreadsheet -- Enzyme Inhibition Constant Data from BindingDB
Found 1 hit for monomerid = 32639
Trg + Lig
Ki
nM
ΔG°
kcal/mole
IC50
nM
Kd
nM
EC50/IC50
nM
koff
s-1
kon
M-1s-1
pHTemp
°C
Biotin Carboxylase
(Escherichia coli (strain K12))
BDBM32639
(amino-oxazole, 2)
Show SMILES Nc1ncc(o1)C(=O)c1cccc(Br)c1
Show InChI InChI=1S/C10H7BrN2O2/c11-7-3-1-2-6(4-7)9(14)8-5-13-10(12)15-8/h1-5H,(H2,12,13)
n/an/a 2.15E+4n/an/an/an/a8.023
Pfizer
Assay Description
Assays were performed in 384-well clear bottom plates (Corning; catalog no. 3702), that contained inhibitor solvated in DMSO. To each well of the pla...
ACS Chem Biol 4: 473-83 (2009)
Article DOI: 10.1021/cb9000102
BindingDB Entry DOI: 10.7270/Q2WM1BR8
3D
3D Structure (crystal)