BDBM326957 N-(1-{4-[(3S)-2,3- dihydro[1,4]dioxino[2,3- b]pyridin-3-yl]benzyl}piperidin-4- yl)methanesulfonamide::US9662339, 190
SMILES: CS(=O)(=O)NC1CCN(Cc2ccc(cc2)[C@H]2COc3cccnc3O2)CC1
InChI Key: InChIKey=KATXSAYIPOWTST-LJQANCHMSA-N
Data: 1 IC50
Activity Spreadsheet -- Enzyme Inhibition Constant Data from BindingDB
Found 1 hit for monomerid = 326957
Trg + Lig
Ki
nM
ΔG°
kcal/mole
IC50
nM
Kd
nM
EC50/IC50
nM
koff
s-1
kon
M-1s-1
pHTemp
°C
Leukotriene A4 hydrolase
(Homo sapiens (Human))
BDBM326957
(N-(1-{4-[(3S)-2,3- dihydro[1,4]dioxino[2,3- b]py...)
Show SMILES CS(=O)(=O)NC1CCN(Cc2ccc(cc2)[C@H]2COc3cccnc3O2)CC1 |r|
Show InChI InChI=1S/C20H25N3O4S/c1-28(24,25)22-17-8-11-23(12-9-17)13-15-4-6-16(7-5-15)19-14-26-18-3-2-10-21-20(18)27-19/h2-7,10,17,19,22H,8-9,11-14H2,1H3/t19-/m1/s1
Reactome pathway
US Patent
n/an/a 0.0900n/an/an/an/an/an/a
Boehringer Ingelheim International GmbH
US Patent
Assay Description
The compounds of the invention are assessed for the ability to interact with human LTA4 hydrolase in an enzymatic assay that measures the ability of ...
US Patent US9662339 (2017)
BindingDB Entry DOI: 10.7270/Q2GT5Q8D