BDBM32701 1-benzotriazolyl(phenyl)methanone::Benzotriazol-1-yl-phenyl-methanone::MLS000529214::SMR000121689::benzotriazol-1-yl(phenyl)methanone::cid_570059
SMILES: O=C(c1ccccc1)n1nnc2ccccc12
InChI Key: InChIKey=UJEMOXPSTTXLRE-UHFFFAOYSA-N
Data: 9 IC50
Activity Spreadsheet -- Enzyme Inhibition Constant Data from BindingDB
Found 9 hits for monomerid = 32701
Trg + Lig
Ki
nM
ΔG°
kcal/mole
IC50
nM
Kd
nM
EC50/IC50
nM
koff
s-1
kon
M-1s-1
pHTemp
°C
Factor XIIa
(Homo sapiens (Human))
BDBM32701
(1-benzotriazolyl(phenyl)methanone | Benzotriazol-1...)
Show SMILES O=C(c1ccccc1)n1nnc2ccccc12
Show InChI InChI=1S/C13H9N3O/c17-13(10-6-2-1-3-7-10)16-12-9-5-4-8-11(12)14-15-16/h1-9H
PCBioAssay
n/an/a 2.01E+3n/an/an/an/a7.423
PCMD
Curated by PubChem BioAssay
Assay Description
HTS was performed on a total of 33,068 compounds of the MLSCN library, 23,017 of which were not in the mixture HTS plates used previously. These comp...
PubChem Bioassay (2007)
BindingDB Entry DOI: 10.7270/Q2PV6HQB
Prothrombin
(Homo sapiens (Human))
BDBM32701
(1-benzotriazolyl(phenyl)methanone | Benzotriazol-1...)
Show SMILES O=C(c1ccccc1)n1nnc2ccccc12
Show InChI InChI=1S/C13H9N3O/c17-13(10-6-2-1-3-7-10)16-12-9-5-4-8-11(12)14-15-16/h1-9H
PCBioAssay
n/an/a 431n/an/an/an/a7.523
PCMD
Curated by PubChem BioAssay
Assay Description
HTS was performed using 217,350 compounds of the MLSCN library individually plated into 10ul 1536 compound plates at a concentration of 2.5 mM each, ...
PubChem Bioassay (2008)
BindingDB Entry DOI: 10.7270/Q2K64GDN
Coagulation factor XI
(Homo sapiens (Human))
BDBM32701
(1-benzotriazolyl(phenyl)methanone | Benzotriazol-1...)
Show SMILES O=C(c1ccccc1)n1nnc2ccccc12
Show InChI InChI=1S/C13H9N3O/c17-13(10-6-2-1-3-7-10)16-12-9-5-4-8-11(12)14-15-16/h1-9H
Reactome pathway
PCBioAssay
n/an/a>5.00E+4n/an/an/an/a7.423
PCMD
Curated by PubChem BioAssay
Assay Description
Factor XIa (0.23 ug/mL) was incubated with Boc-Glu-Ala-Arg-AMC substrate (15 uM) in 10 uL of assay buffer for 2 hr at room temperature. Read fluoresc...
PubChem Bioassay (2008)
BindingDB Entry DOI: 10.7270/Q2N29V8J
Coagulation factor XI
(Homo sapiens (Human))
BDBM32701
(1-benzotriazolyl(phenyl)methanone | Benzotriazol-1...)
Show SMILES O=C(c1ccccc1)n1nnc2ccccc12
Show InChI InChI=1S/C13H9N3O/c17-13(10-6-2-1-3-7-10)16-12-9-5-4-8-11(12)14-15-16/h1-9H
Reactome pathway
PCBioAssay
n/an/a>5.00E+4n/an/an/an/a7.423
PCMD
Curated by PubChem BioAssay
Assay Description
Factor XIa (0.23 ug/mL) was incubated with Boc-Glu-Ala-Arg-AMC substrate (15 uM) in 10 uL of assay buffer for 2 hr at room temperature. Read fluoresc...
PubChem Bioassay (2008)
BindingDB Entry DOI: 10.7270/Q2H993J6
Probable maltase-glucoamylase 2
(Homo sapiens)
BDBM32701
(1-benzotriazolyl(phenyl)methanone | Benzotriazol-1...)
Show SMILES O=C(c1ccccc1)n1nnc2ccccc12
Show InChI InChI=1S/C13H9N3O/c17-13(10-6-2-1-3-7-10)16-12-9-5-4-8-11(12)14-15-16/h1-9H
n/an/a 5.29E+3n/an/an/an/an/an/a
University of Karachi
Curated by ChEMBL
Assay Description
Inhibition of alpha-glucosidase (unknown origin)
Eur J Med Chem 183: (2019)
Article DOI: 10.1016/j.ejmech.2019.111677
Factor XIIa
(Homo sapiens (Human))
BDBM32701
(1-benzotriazolyl(phenyl)methanone | Benzotriazol-1...)
Show SMILES O=C(c1ccccc1)n1nnc2ccccc12
Show InChI InChI=1S/C13H9N3O/c17-13(10-6-2-1-3-7-10)16-12-9-5-4-8-11(12)14-15-16/h1-9H
PCBioAssay
n/an/a 2.01E+3n/an/an/an/an/an/a
PCMD
Curated by PubChem BioAssay
Assay Description
Molecular Library Screening Center Network (MLSCN) Penn Center for Molecular Discovery (PCMD) Assay Provider: Scott L. Diamond, University of Pennsy...
PubChem Bioassay (2008)
BindingDB Entry DOI: 10.7270/Q21G0JQS
Kallikrein 5
(Homo sapiens (Human))
BDBM32701
(1-benzotriazolyl(phenyl)methanone | Benzotriazol-1...)
Show SMILES O=C(c1ccccc1)n1nnc2ccccc12
Show InChI InChI=1S/C13H9N3O/c17-13(10-6-2-1-3-7-10)16-12-9-5-4-8-11(12)14-15-16/h1-9H
PCBioAssay
n/an/a 4.55E+3n/an/an/an/an/an/a
PCMD
Curated by PubChem BioAssay
Assay Description
Molecular Library Screening Center Network (MLSCN) Penn Center for Molecular Discovery (PCMD) Assay Provider: Scott L. Diamond, University of Pennsy...
PubChem Bioassay (2008)
BindingDB Entry DOI: 10.7270/Q2GH9GC8
Sodium/hydrogen exchanger 1
(Homo sapiens (Human))
BDBM32701
(1-benzotriazolyl(phenyl)methanone | Benzotriazol-1...)
Show SMILES O=C(c1ccccc1)n1nnc2ccccc12
Show InChI InChI=1S/C13H9N3O/c17-13(10-6-2-1-3-7-10)16-12-9-5-4-8-11(12)14-15-16/h1-9H
NCI pathway
Reactome pathway
n/an/a 5.16E+4n/an/an/an/an/an/a
Punjabi University
Curated by ChEMBL
Assay Description
Inhibition of platelet NHE1 in human platelet rich plasma assessed as decrease in platelet swelling preincubated for 3 mins followed by sodium propio...
Eur J Med Chem 126: 183-189 (2017)
BindingDB Entry DOI: 10.7270/Q26H4KNQ
Coagulation factor XI
(Homo sapiens (Human))
BDBM32701
(1-benzotriazolyl(phenyl)methanone | Benzotriazol-1...)
Show SMILES O=C(c1ccccc1)n1nnc2ccccc12
Show InChI InChI=1S/C13H9N3O/c17-13(10-6-2-1-3-7-10)16-12-9-5-4-8-11(12)14-15-16/h1-9H
Reactome pathway
PCBioAssay
n/an/a>5.00E+4n/an/an/an/an/an/a
PCMD
Curated by PubChem BioAssay
Assay Description
Molecular Library Screening Center Network (MLSCN) Penn Center for Molecular Discovery (PCMD) Assay Provider: Scott L. Diamond, University of Pennsy...
PubChem Bioassay (2008)
BindingDB Entry DOI: 10.7270/Q2W957K6