null
SMILES: CC1(C)CC(=O)C=C(C1)OC(=O)c1ccc(Cl)cc1
InChI Key: InChIKey=KKORKSCDUXGMSV-UHFFFAOYSA-N
Activity Spreadsheet -- Enzyme Inhibition Constant Data from BindingDB
Found 3 hits for monomerid = 32847
Trg + Lig
Ki
nM
ΔG°
kcal/mole
IC50
nM
Kd
nM
EC50/IC50
nM
koff
s-1
kon
M-1s-1
pHTemp
°C
Macrophage migration inhibitory factor
(Homo sapiens (Human))
BDBM32847
((5,5-dimethyl-3-oxidanylidene-cyclohexen-1-yl) 4-c...)
Show SMILES CC1(C)CC(=O)C=C(C1)OC(=O)c1ccc(Cl)cc1 |c:6|
Show InChI InChI=1S/C15H15ClO3/c1-15(2)8-12(17)7-13(9-15)19-14(18)10-3-5-11(16)6-4-10/h3-7H,8-9H2,1-2H3
1.30E+3n/a 3.31E+3n/an/an/an/a6.5n/a
Ecole Polytechnique Fédérale de Lausanne
Assay Description
The assay principle is based on measuring the absorbance of D-dopachrome methyl ester (red), which is transformed by enzymatically active MIF to the ...
J Biol Chem 285: 26581-98 (2010)
Article DOI: 10.1074/jbc.M110.113951
BindingDB Entry DOI: 10.7270/Q2XD1083
Coagulation factor XI
(Homo sapiens (Human))
BDBM32847
((5,5-dimethyl-3-oxidanylidene-cyclohexen-1-yl) 4-c...)
Show SMILES CC1(C)CC(=O)C=C(C1)OC(=O)c1ccc(Cl)cc1 |c:6|
Show InChI InChI=1S/C15H15ClO3/c1-15(2)8-12(17)7-13(9-15)19-14(18)10-3-5-11(16)6-4-10/h3-7H,8-9H2,1-2H3
Reactome pathway
PCBioAssay
n/an/a 8.55E+3n/an/an/an/a7.423
PCMD
Curated by PubChem BioAssay
Assay Description
Factor XIa (0.23 ug/mL) was incubated with Boc-Glu-Ala-Arg-AMC substrate (15 uM) in 10 uL of assay buffer for 2 hr at room temperature. Read fluoresc...
PubChem Bioassay (2008)
BindingDB Entry DOI: 10.7270/Q2H993J6
Coagulation factor XII
(Homo sapiens (Human))
BDBM32847
((5,5-dimethyl-3-oxidanylidene-cyclohexen-1-yl) 4-c...)
Show SMILES CC1(C)CC(=O)C=C(C1)OC(=O)c1ccc(Cl)cc1 |c:6|
Show InChI InChI=1S/C15H15ClO3/c1-15(2)8-12(17)7-13(9-15)19-14(18)10-3-5-11(16)6-4-10/h3-7H,8-9H2,1-2H3
PCBioAssay
n/an/a 1.55E+4n/an/an/an/an/an/a
PCMD
Curated by PubChem BioAssay
Assay Description
Molecular Library Screening Center Network (MLSCN) Penn Center for Molecular Discovery (PCMD) Assay Provider: Scott L. Diamond, University of Pennsy...
PubChem Bioassay (2008)
BindingDB Entry DOI: 10.7270/Q21G0JQS