BDBM329000 1137478-46-6::US9663503, Compound Y-153
SMILES: CC(C)(O)C#Cc1cnc(Nc2cnc(cn2)C#N)cc1NC[C@@H]1CNCCO1
InChI Key: InChIKey=IDZXROKRAQBADP-INIZCTEOSA-N
Data: 1 IC50
Activity Spreadsheet -- Enzyme Inhibition Constant Data from BindingDB
Found 1 hit for monomerid = 329000
Trg + Lig
Ki
nM
ΔG°
kcal/mole
IC50
nM
Kd
nM
EC50/IC50
nM
koff
s-1
kon
M-1s-1
pHTemp
°C
Serine/threonine-protein kinase Chk1
(Homo sapiens (Human))
BDBM329000
(1137478-46-6 | US9663503, Compound Y-153)
Show SMILES CC(C)(O)C#Cc1cnc(Nc2cnc(cn2)C#N)cc1NC[C@@H]1CNCCO1 |r|
Show InChI InChI=1S/C20H23N7O2/c1-20(2,28)4-3-14-9-25-18(27-19-13-23-15(8-21)10-26-19)7-17(14)24-12-16-11-22-5-6-29-16/h7,9-10,13,16,22,28H,5-6,11-12H2,1-2H3,(H2,24,25,26,27)/t16-/m0/s1
Reactome pathway
US Patent
n/an/a 4n/an/an/an/an/an/a
Cancer Research Technology Limited
US Patent
Assay Description
CHK1 kinase activity was measured in a microfluidic assay that monitors the separation of a phosphorylated product from its substrate. The assay was ...
US Patent US9663503 (2017)
BindingDB Entry DOI: 10.7270/Q2T43W7G