null
SMILES: COc1cc(ccc1Nc1nc2ccc(cn2n1)-c1ccc(NC(=O)[C@H](C)c2ccc(F)cc2)cc1)S(C)(=O)=O
InChI Key: InChIKey=NRJKIOCCERLIDG-GOSISDBHSA-N
PDB links: 2 PDB IDs match this monomer.
Activity Spreadsheet -- Enzyme Inhibition Constant Data from BindingDB
Found 5 hits for monomerid = 329334
Trg + Lig
Ki
nM
ΔG°
kcal/mole
IC50
nM
Kd
nM
EC50/IC50
nM
koff
s-1
kon
M-1s-1
pHTemp
°C
Dual specificity protein kinase TTK
(Homo sapiens (Human))
BDBM329334
((2R)-2-(4-fluorophenyl)-N-[4-(2-{[2-methoxy-4-(met...)
Show SMILES COc1cc(ccc1Nc1nc2ccc(cn2n1)-c1ccc(NC(=O)[C@H](C)c2ccc(F)cc2)cc1)S(C)(=O)=O |r|
Show InChI InChI=1S/C29H26FN5O4S/c1-18(19-4-9-22(30)10-5-19)28(36)31-23-11-6-20(7-12-23)21-8-15-27-33-29(34-35(27)17-21)32-25-14-13-24(40(3,37)38)16-26(25)39-2/h4-18H,1-3H3,(H,31,36)(H,32,34)/t18-/m1/s1
US Patent
n/an/a<1n/an/an/an/an/an/a
BAYER PHARMA AKTIENGESELLSCHAFT; BAYER INTELLECTUAL PROPERTY GMBH
US Patent
Assay Description
For the assay 50 nl of a 100-fold concentrated solution of the test compound in DMSO was pipetted into a black low volume 384 well microtiter plate (...
US Patent US9663510 (2017)
BindingDB Entry DOI: 10.7270/Q2DV1N06
3D
3D Structure (crystal)
Dual specificity protein kinase TTK
(Homo sapiens (Human))
BDBM329334
((2R)-2-(4-fluorophenyl)-N-[4-(2-{[2-methoxy-4-(met...)
Show SMILES COc1cc(ccc1Nc1nc2ccc(cn2n1)-c1ccc(NC(=O)[C@H](C)c2ccc(F)cc2)cc1)S(C)(=O)=O |r|
Show InChI InChI=1S/C29H26FN5O4S/c1-18(19-4-9-22(30)10-5-19)28(36)31-23-11-6-20(7-12-23)21-8-15-27-33-29(34-35(27)17-21)32-25-14-13-24(40(3,37)38)16-26(25)39-2/h4-18H,1-3H3,(H,31,36)(H,32,34)/t18-/m1/s1
n/an/a 0.340n/an/an/an/an/an/a
Jilin University
Curated by ChEMBL
Assay Description
Inhibition of MPS1 (unknown origin) using biotin-AhxPWDPDDADITEILG-NH2 as substrate preincubated for 15 mins followed by substrate addition by TR-FRE...
Eur J Med Chem 175: 247-268 (2019)
Article DOI: 10.1016/j.ejmech.2019.04.047
3D
3D Structure (crystal)
Dual specificity protein kinase TTK
(Homo sapiens (Human))
BDBM329334
((2R)-2-(4-fluorophenyl)-N-[4-(2-{[2-methoxy-4-(met...)
Show SMILES COc1cc(ccc1Nc1nc2ccc(cn2n1)-c1ccc(NC(=O)[C@H](C)c2ccc(F)cc2)cc1)S(C)(=O)=O |r|
Show InChI InChI=1S/C29H26FN5O4S/c1-18(19-4-9-22(30)10-5-19)28(36)31-23-11-6-20(7-12-23)21-8-15-27-33-29(34-35(27)17-21)32-25-14-13-24(40(3,37)38)16-26(25)39-2/h4-18H,1-3H3,(H,31,36)(H,32,34)/t18-/m1/s1
n/an/a 2.55n/an/an/an/an/an/a
TBA
Citation and Details
3D
3D Structure (crystal)
Dual specificity protein kinase TTK
(Homo sapiens (Human))
BDBM329334
((2R)-2-(4-fluorophenyl)-N-[4-(2-{[2-methoxy-4-(met...)
Show SMILES COc1cc(ccc1Nc1nc2ccc(cn2n1)-c1ccc(NC(=O)[C@H](C)c2ccc(F)cc2)cc1)S(C)(=O)=O |r|
Show InChI InChI=1S/C29H26FN5O4S/c1-18(19-4-9-22(30)10-5-19)28(36)31-23-11-6-20(7-12-23)21-8-15-27-33-29(34-35(27)17-21)32-25-14-13-24(40(3,37)38)16-26(25)39-2/h4-18H,1-3H3,(H,31,36)(H,32,34)/t18-/m1/s1
n/an/a 53n/an/an/an/an/an/a
Bayer AG
Curated by ChEMBL
Assay Description
Inhibition of MPS1 in human HeLa cells assessed as reduction in spindle assembly checkpoint incubated for 4 hrs by p-histone H3/Hoechst 33342 stainin...
J Med Chem 63: 8025-8042 (2020)
3D
3D Structure (crystal)
Dual specificity protein kinase TTK
(Homo sapiens (Human))
BDBM329334
((2R)-2-(4-fluorophenyl)-N-[4-(2-{[2-methoxy-4-(met...)
Show SMILES COc1cc(ccc1Nc1nc2ccc(cn2n1)-c1ccc(NC(=O)[C@H](C)c2ccc(F)cc2)cc1)S(C)(=O)=O |r|
Show InChI InChI=1S/C29H26FN5O4S/c1-18(19-4-9-22(30)10-5-19)28(36)31-23-11-6-20(7-12-23)21-8-15-27-33-29(34-35(27)17-21)32-25-14-13-24(40(3,37)38)16-26(25)39-2/h4-18H,1-3H3,(H,31,36)(H,32,34)/t18-/m1/s1
n/an/a 1.70n/an/an/an/an/an/a
Bayer AG
Curated by ChEMBL
Assay Description
Inhibition of GST-tagged recombinant human MPS1 expressed in baculovirus expression system using biotin-Ahx-PWDPDDADITEILG as substrate preincubated ...
J Med Chem 63: 8025-8042 (2020)
3D
3D Structure (crystal)