BDBM329340 (2R)—N-{4-[2-({4-[(3-fluoroazetidin-1-yl)carbonyl]-2-methoxyphenyl}amino)-[1,2,4]triazolo[1,5-a]pyridin-6-yl]phenyl}-2-(4-fluorophenyl)propanamide::US9663510, Example 01.07
SMILES: COc1cc(ccc1Nc1nc2ccc(cn2n1)-c1ccc(NC(=O)[C@H](C)c2ccc(F)cc2)cc1)C(=O)N1CC(F)C1
InChI Key: InChIKey=JNKUNFBRYLQETD-LJQANCHMSA-N
Data: 3 IC50
Activity Spreadsheet -- Enzyme Inhibition Constant Data from BindingDB
Found 3 hits for monomerid = 329340
Trg + Lig
Ki
nM
ΔG°
kcal/mole
IC50
nM
Kd
nM
EC50/IC50
nM
koff
s-1
kon
M-1s-1
pHTemp
°C
Dual specificity protein kinase TTK
(Homo sapiens (Human))
BDBM329340
((2R)—N-{4-[2-({4-[(3-fluoroazetidin-1-yl)carb...)
Show SMILES COc1cc(ccc1Nc1nc2ccc(cn2n1)-c1ccc(NC(=O)[C@H](C)c2ccc(F)cc2)cc1)C(=O)N1CC(F)C1 |r|
Show InChI InChI=1S/C32H28F2N6O3/c1-19(20-3-9-24(33)10-4-20)30(41)35-26-11-5-21(6-12-26)23-8-14-29-37-32(38-40(29)16-23)36-27-13-7-22(15-28(27)43-2)31(42)39-17-25(34)18-39/h3-16,19,25H,17-18H2,1-2H3,(H,35,41)(H,36,38)/t19-/m1/s1
US Patent
n/an/a<1n/an/an/an/an/an/a
BAYER PHARMA AKTIENGESELLSCHAFT; BAYER INTELLECTUAL PROPERTY GMBH
US Patent
Assay Description
For the assay 50 nl of a 100-fold concentrated solution of the test compound in DMSO was pipetted into a black low volume 384 well microtiter plate (...
US Patent US9663510 (2017)
BindingDB Entry DOI: 10.7270/Q2DV1N06
Dual specificity protein kinase TTK
(Homo sapiens (Human))
BDBM329340
((2R)—N-{4-[2-({4-[(3-fluoroazetidin-1-yl)carb...)
Show SMILES COc1cc(ccc1Nc1nc2ccc(cn2n1)-c1ccc(NC(=O)[C@H](C)c2ccc(F)cc2)cc1)C(=O)N1CC(F)C1 |r|
Show InChI InChI=1S/C32H28F2N6O3/c1-19(20-3-9-24(33)10-4-20)30(41)35-26-11-5-21(6-12-26)23-8-14-29-37-32(38-40(29)16-23)36-27-13-7-22(15-28(27)43-2)31(42)39-17-25(34)18-39/h3-16,19,25H,17-18H2,1-2H3,(H,35,41)(H,36,38)/t19-/m1/s1
n/an/a 15n/an/an/an/an/an/a
Bayer AG
Curated by ChEMBL
Assay Description
Inhibition of MPS1 in human HeLa cells assessed as reduction in spindle assembly checkpoint incubated for 4 hrs by p-histone H3/Hoechst 33342 stainin...
J Med Chem 63: 8025-8042 (2020)
Dual specificity protein kinase TTK
(Homo sapiens (Human))
BDBM329340
((2R)—N-{4-[2-({4-[(3-fluoroazetidin-1-yl)carb...)
Show SMILES COc1cc(ccc1Nc1nc2ccc(cn2n1)-c1ccc(NC(=O)[C@H](C)c2ccc(F)cc2)cc1)C(=O)N1CC(F)C1 |r|
Show InChI InChI=1S/C32H28F2N6O3/c1-19(20-3-9-24(33)10-4-20)30(41)35-26-11-5-21(6-12-26)23-8-14-29-37-32(38-40(29)16-23)36-27-13-7-22(15-28(27)43-2)31(42)39-17-25(34)18-39/h3-16,19,25H,17-18H2,1-2H3,(H,35,41)(H,36,38)/t19-/m1/s1
n/an/a 0.5n/an/an/an/an/an/a
Bayer AG
Curated by ChEMBL
Assay Description
Inhibition of GST-tagged recombinant human MPS1 expressed in baculovirus expression system using biotin-Ahx-PWDPDDADITEILG as substrate preincubated ...
J Med Chem 63: 8025-8042 (2020)