BDBM329341 (2R)—N-[4-(2-{[4-(azetidin-1-ylcarbonyl)-2-methoxyphenyl]amino}[1,2,4]-triazolo[1,5-a]pyridin-6-yl)phenyl]-2-(4-fluorophenyl)propanamide::US9663510, Example 01.08
SMILES: COc1cc(ccc1Nc1nc2ccc(cn2n1)-c1ccc(NC(=O)[C@H](C)c2ccc(F)cc2)cc1)C(=O)N1CCC1
InChI Key: InChIKey=FTFZNKWITBPFHD-HXUWFJFHSA-N
Data: 1 IC50
Activity Spreadsheet -- Enzyme Inhibition Constant Data from BindingDB
Found 1 hit for monomerid = 329341
Trg + Lig
Ki
nM
ΔG°
kcal/mole
IC50
nM
Kd
nM
EC50/IC50
nM
koff
s-1
kon
M-1s-1
pHTemp
°C
Dual specificity protein kinase TTK
(Homo sapiens (Human))
BDBM329341
((2R)—N-[4-(2-{[4-(azetidin-1-ylcarbonyl)-2-me...)
Show SMILES COc1cc(ccc1Nc1nc2ccc(cn2n1)-c1ccc(NC(=O)[C@H](C)c2ccc(F)cc2)cc1)C(=O)N1CCC1 |r|
Show InChI InChI=1S/C32H29FN6O3/c1-20(21-4-10-25(33)11-5-21)30(40)34-26-12-6-22(7-13-26)24-9-15-29-36-32(37-39(29)19-24)35-27-14-8-23(18-28(27)42-2)31(41)38-16-3-17-38/h4-15,18-20H,3,16-17H2,1-2H3,(H,34,40)(H,35,37)/t20-/m1/s1
US Patent
n/an/a<1n/an/an/an/an/an/a
BAYER PHARMA AKTIENGESELLSCHAFT; BAYER INTELLECTUAL PROPERTY GMBH
US Patent
Assay Description
For the assay 50 nl of a 100-fold concentrated solution of the test compound in DMSO was pipetted into a black low volume 384 well microtiter plate (...
US Patent US9663510 (2017)
BindingDB Entry DOI: 10.7270/Q2DV1N06