BDBM329353 (2R)-2-amino-2-(4-fluorophenyl)-N-[4-(2-{[2-methoxy-4-(2-oxo-1,3-oxazolidin-3-yl)phenyl]amino}[1,2,4]triazolo[1,5-a]pyridin-6-yl)phenyl]ethanamide::US9663510, Example 01.20
SMILES: COc1cc(ccc1Nc1nc2ccc(cn2n1)-c1ccc(NC(=O)[C@H](N)c2ccc(F)cc2)cc1)N1CCOC1=O
InChI Key: InChIKey=VQHFHMPHSRDHRP-HHHXNRCGSA-N
Data: 1 IC50
Activity Spreadsheet -- Enzyme Inhibition Constant Data from BindingDB
Found 1 hit for monomerid = 329353
Trg + Lig
Ki
nM
ΔG°
kcal/mole
IC50
nM
Kd
nM
EC50/IC50
nM
koff
s-1
kon
M-1s-1
pHTemp
°C
Dual specificity protein kinase TTK
(Homo sapiens (Human))
BDBM329353
((2R)-2-amino-2-(4-fluorophenyl)-N-[4-(2-{[2-methox...)
Show SMILES COc1cc(ccc1Nc1nc2ccc(cn2n1)-c1ccc(NC(=O)[C@H](N)c2ccc(F)cc2)cc1)N1CCOC1=O |r|
Show InChI InChI=1S/C30H26FN7O4/c1-41-25-16-23(37-14-15-42-30(37)40)11-12-24(25)34-29-35-26-13-6-20(17-38(26)36-29)18-4-9-22(10-5-18)33-28(39)27(32)19-2-7-21(31)8-3-19/h2-13,16-17,27H,14-15,32H2,1H3,(H,33,39)(H,34,36)/t27-/m1/s1
US Patent
n/an/a<1n/an/an/an/an/an/a
BAYER PHARMA AKTIENGESELLSCHAFT; BAYER INTELLECTUAL PROPERTY GMBH
US Patent
Assay Description
For the assay 50 nl of a 100-fold concentrated solution of the test compound in DMSO was pipetted into a black low volume 384 well microtiter plate (...
US Patent US9663510 (2017)
BindingDB Entry DOI: 10.7270/Q2DV1N06