null
SMILES: Cc1nnc2[C@@H](Cc3nnc(o3)-c3cccnc3)C=C(c3ccc(Cl)cc3)c3ccccc3-n12
InChI Key: InChIKey=OZUKYYBTCWITSE-LJQANCHMSA-N
Activity Spreadsheet -- Enzyme Inhibition Constant Data from BindingDB
Found 1 hit for monomerid = 329781
Trg + Lig
Ki
nM
ΔG°
kcal/mole
IC50
nM
Kd
nM
EC50/IC50
nM
koff
s-1
kon
M-1s-1
pHTemp
°C
Bromodomain-containing protein 4
(Homo sapiens (Human))
BDBM329781
(Preparation of (−)-(4R)-6-(4-chlorophenyl)-1...)
Show SMILES Cc1nnc2[C@@H](Cc3nnc(o3)-c3cccnc3)C=C(c3ccc(Cl)cc3)c3ccccc3-n12 |r,t:20|
Show InChI InChI=1S/C26H19ClN6O/c1-16-29-31-25-19(14-24-30-32-26(34-24)18-5-4-12-28-15-18)13-22(17-8-10-20(27)11-9-17)21-6-2-3-7-23(21)33(16)25/h2-13,15,19H,14H2,1H3/t19-/m1/s1
US Patent
n/an/a 50n/an/an/an/an/an/a
BAYER PHARMA AKTIENGESELLSCHAFT
US Patent
Assay Description
For this purpose, a time-resolved fluorescence resonance energy transfer (TR-FRET) assay was used, which measures the binding between N-terminally Hi...
US Patent US9663523 (2017)
BindingDB Entry DOI: 10.7270/Q2NC639V