BDBM330053 (2R,5S,13aR)-N-(2-chloro-4-fluorobenzyl)-8-hydroxy-7,9-dioxo-2,3,4,5,7,9,13,13a-octahydro-2,5-methanopyrido[1′,2′:4,5]pyrazino[2,1-b][3]oxazepine-10-carboxamide::US9663528, 63
SMILES: Oc1c2C(=O)N3[C@H]4CC[C@H](C4)[C@H]3Cn2cc(C(=O)NCc2ccc(Cl)cc2F)c1=O
InChI Key: InChIKey=CLDKIKVUKMVPFT-AKWBHNSASA-N
Data: 1 IC50
Activity Spreadsheet -- Enzyme Inhibition Constant Data from BindingDB
Found 1 hit for monomerid = 330053
Trg + Lig
Ki
nM
ΔG°
kcal/mole
IC50
nM
Kd
nM
EC50/IC50
nM
koff
s-1
kon
M-1s-1
pHTemp
°C
Solute carrier family 22 member 2
(Homo sapiens (Human))
BDBM330053
((2R,5S,13aR)-N-(2-chloro-4-fluorobenzyl)-8-hydroxy...)
Show SMILES Oc1c2C(=O)N3[C@H]4CC[C@H](C4)[C@H]3Cn2cc(C(=O)NCc2ccc(Cl)cc2F)c1=O |THB:12:11:7.8:10,3:5:7.8:10|
Show InChI InChI=1S/C21H19ClFN3O4/c22-12-3-1-11(15(23)6-12)7-24-20(29)14-8-25-9-16-10-2-4-13(5-10)26(16)21(30)17(25)19(28)18(14)27/h1,3,6,8,10,13,16,28H,2,4-5,7,9H2,(H,24,29)/t10-,13+,16-/m1/s1
Reactome pathway
US Patent
n/an/a 42n/an/an/an/an/an/a
Gilead Sciences, Inc.
US Patent
Assay Description
The dose dependent inhibition of OCT2 mediated uptake of a model substrate 14C-Tetraethylammonium (TEA) by test compounds was studied in wild-type an...
US Patent US9663528 (2017)
BindingDB Entry DOI: 10.7270/Q24F1SVF