BDBM330303 US9725426, 7
SMILES: CCCN(N)c1nnn[nH]1
InChI Key: InChIKey=VGMWTSPUHRTAIP-UHFFFAOYSA-N
Data: 1 IC50
Activity Spreadsheet -- Enzyme Inhibition Constant Data from BindingDB
Found 1 hit for monomerid = 330303
Trg + Lig
Ki
nM
ΔG°
kcal/mole
IC50
nM
Kd
nM
EC50/IC50
nM
koff
s-1
kon
M-1s-1
pHTemp
°C
Cystathionine gamma-lyase
(Homo sapiens (Human))
BDBM330303
(US9725426, 7)
Show SMILES CCCN(N)c1nnn[nH]1
Show InChI InChI=1S/C4H10N6/c1-2-3-10(5)4-6-8-9-7-4/h2-3,5H2,1H3,(H,6,7,8,9)
Reactome pathway
US Patent
n/an/a 5.50E+4n/an/an/an/an/an/a
SOVA PHARMACEUTICALS, INC.
US Patent
Assay Description
Test compounds (from DMSO stock solutions) were added to (final concentrations) 20 ug/ml enzyme solution (human, mouse or rat recombinant CSE) plus 5...
US Patent US9725426 (2017)
BindingDB Entry DOI: 10.7270/Q2765HG7