BDBM330314 US9725426, 18
SMILES: CN(C)c1ccc(\C=N\Nc2nnn[nH]2)cc1
InChI Key: InChIKey=VGXJMBOWJUVGBN-YRNVUSSQSA-N
Data: 1 IC50
Activity Spreadsheet -- Enzyme Inhibition Constant Data from BindingDB
Found 1 hit for monomerid = 330314
Trg + Lig
Ki
nM
ΔG°
kcal/mole
IC50
nM
Kd
nM
EC50/IC50
nM
koff
s-1
kon
M-1s-1
pHTemp
°C
Cystathionine gamma-lyase
(Homo sapiens (Human))
BDBM330314
(US9725426, 18)
Show SMILES CN(C)c1ccc(\C=N\Nc2nnn[nH]2)cc1
Show InChI InChI=1S/C10H13N7/c1-17(2)9-5-3-8(4-6-9)7-11-12-10-13-15-16-14-10/h3-7H,1-2H3,(H2,12,13,14,15,16)/b11-7+
Reactome pathway
US Patent
n/an/a 5.50E+4n/an/an/an/an/an/a
SOVA PHARMACEUTICALS, INC.
US Patent
Assay Description
Test compounds (from DMSO stock solutions) were added to (final concentrations) 20 ug/ml enzyme solution (human, mouse or rat recombinant CSE) plus 5...
US Patent US9725426 (2017)
BindingDB Entry DOI: 10.7270/Q2765HG7