BDBM330316 US9725426, 20
SMILES: Clc1ccc(\C=N\Nc2nnn[nH]2)cc1
InChI Key: InChIKey=SZFUMFNPTAQHAI-BJMVGYQFSA-N
Data: 1 IC50
Activity Spreadsheet -- Enzyme Inhibition Constant Data from BindingDB
Found 1 hit for monomerid = 330316
Trg + Lig
Ki
nM
ΔG°
kcal/mole
IC50
nM
Kd
nM
EC50/IC50
nM
koff
s-1
kon
M-1s-1
pHTemp
°C
Cystathionine gamma-lyase
(Homo sapiens (Human))
BDBM330316
(US9725426, 20)
Show SMILES Clc1ccc(\C=N\Nc2nnn[nH]2)cc1
Show InChI InChI=1S/C8H7ClN6/c9-7-3-1-6(2-4-7)5-10-11-8-12-14-15-13-8/h1-5H,(H2,11,12,13,14,15)/b10-5+
Reactome pathway
US Patent
n/an/a<1.00E+4n/an/an/an/an/an/a
SOVA PHARMACEUTICALS, INC.
US Patent
Assay Description
Test compounds (from DMSO stock solutions) were added to (final concentrations) 20 ug/ml enzyme solution (human, mouse or rat recombinant CSE) plus 5...
US Patent US9725426 (2017)
BindingDB Entry DOI: 10.7270/Q2765HG7