BDBM330321 US9725426, 25
SMILES: CC\C(C)=N\Nc1nnn[nH]1
InChI Key: InChIKey=UKUKDHVRDOVJMQ-GQCTYLIASA-N
Data: 1 IC50
Activity Spreadsheet -- Enzyme Inhibition Constant Data from BindingDB
Found 1 hit for monomerid = 330321
Trg + Lig
Ki
nM
ΔG°
kcal/mole
IC50
nM
Kd
nM
EC50/IC50
nM
koff
s-1
kon
M-1s-1
pHTemp
°C
Cystathionine gamma-lyase
(Homo sapiens (Human))
BDBM330321
(US9725426, 25)
Show SMILES CC\C(C)=N\Nc1nnn[nH]1
Show InChI InChI=1S/C5H10N6/c1-3-4(2)6-7-5-8-10-11-9-5/h3H2,1-2H3,(H2,7,8,9,10,11)/b6-4+
Reactome pathway
US Patent
n/an/a<1.00E+4n/an/an/an/an/an/a
SOVA PHARMACEUTICALS, INC.
US Patent
Assay Description
Test compounds (from DMSO stock solutions) were added to (final concentrations) 20 ug/ml enzyme solution (human, mouse or rat recombinant CSE) plus 5...
US Patent US9725426 (2017)
BindingDB Entry DOI: 10.7270/Q2765HG7