BDBM330325 US9725426, 29
SMILES: CN(N)c1nnn(C)n1
InChI Key: InChIKey=LUYYWKPFTIQEFK-UHFFFAOYSA-N
Data: 1 IC50
Activity Spreadsheet -- Enzyme Inhibition Constant Data from BindingDB
Found 1 hit for monomerid = 330325
Trg + Lig
Ki
nM
ΔG°
kcal/mole
IC50
nM
Kd
nM
EC50/IC50
nM
koff
s-1
kon
M-1s-1
pHTemp
°C
Cystathionine gamma-lyase
(Homo sapiens (Human))
BDBM330325
(US9725426, 29)
Show SMILES CN(N)c1nnn(C)n1
Show InChI InChI=1S/C3H8N6/c1-8(4)3-5-7-9(2)6-3/h4H2,1-2H3
Reactome pathway
US Patent
n/an/a>1.00E+5n/an/an/an/an/an/a
SOVA PHARMACEUTICALS, INC.
US Patent
Assay Description
Test compounds (from DMSO stock solutions) were added to (final concentrations) 20 ug/ml enzyme solution (human, mouse or rat recombinant CSE) plus 5...
US Patent US9725426 (2017)
BindingDB Entry DOI: 10.7270/Q2765HG7