BDBM330335 US9725426, (E)-1-((2-(1H-tetrazol-5-yl)hydrazono)methyl)naphthalen-2-ol
SMILES: Oc1ccc2ccccc2c1\C=N\Nc1nnn[nH]1
InChI Key: InChIKey=SIDSDJZHUIIWQR-NTUHNPAUSA-N
Data: 1 IC50
Activity Spreadsheet -- Enzyme Inhibition Constant Data from BindingDB
Found 1 hit for monomerid = 330335
Trg + Lig
Ki
nM
ΔG°
kcal/mole
IC50
nM
Kd
nM
EC50/IC50
nM
koff
s-1
kon
M-1s-1
pHTemp
°C
Cystathionine gamma-lyase
(Homo sapiens (Human))
BDBM330335
(US9725426, (E)-1-((2-(1H-tetrazol-5-yl)hydrazono)m...)
Show SMILES Oc1ccc2ccccc2c1\C=N\Nc1nnn[nH]1
Show InChI InChI=1S/C12H10N6O/c19-11-6-5-8-3-1-2-4-9(8)10(11)7-13-14-12-15-17-18-16-12/h1-7,19H,(H2,14,15,16,17,18)/b13-7+
Reactome pathway
US Patent
n/an/a>1.00E+5n/an/an/an/an/an/a
SOVA PHARMACEUTICALS, INC.
US Patent
Assay Description
Test compounds (from DMSO stock solutions) were added to (final concentrations) 20 ug/ml enzyme solution (human, mouse or rat recombinant CSE) plus 5...
US Patent US9725426 (2017)
BindingDB Entry DOI: 10.7270/Q2765HG7