null
SMILES: Oc1ccc(\C=N\Nc2nnn[nH]2)cc1
InChI Key: InChIKey=KHEWKNZODDGTAV-WEVVVXLNSA-N
Activity Spreadsheet -- Enzyme Inhibition Constant Data from BindingDB
Found 1 hit for monomerid = 330337
Trg + Lig
Ki
nM
ΔG°
kcal/mole
IC50
nM
Kd
nM
EC50/IC50
nM
koff
s-1
kon
M-1s-1
pHTemp
°C
Cystathionine gamma-lyase
(Homo sapiens (Human))
BDBM330337
(US9725426, (E)-4-((2-(1H-tetrazol-5-yl)hydrazono)m...)
Show SMILES Oc1ccc(\C=N\Nc2nnn[nH]2)cc1
Show InChI InChI=1S/C8H8N6O/c15-7-3-1-6(2-4-7)5-9-10-8-11-13-14-12-8/h1-5,15H,(H2,10,11,12,13,14)/b9-5+
Reactome pathway
US Patent
n/an/a 5.50E+4n/an/an/an/an/an/a
SOVA PHARMACEUTICALS, INC.
US Patent
Assay Description
Test compounds (from DMSO stock solutions) were added to (final concentrations) 20 ug/ml enzyme solution (human, mouse or rat recombinant CSE) plus 5...
US Patent US9725426 (2017)
BindingDB Entry DOI: 10.7270/Q2765HG7