BDBM330391 US9725436, Entry 10
SMILES: Clc1cc(\C=C\c2ccc(cc2)N2CCN(CC2)C2=NCCO2)cc(c1)-c1ccncc1
InChI Key: InChIKey=NGGFYUPEXGIRCT-OWOJBTEDSA-N
Data: 4 IC50
Activity Spreadsheet -- Enzyme Inhibition Constant Data from BindingDB
Found 4 hits for monomerid = 330391
Trg + Lig
Ki
nM
ΔG°
kcal/mole
IC50
nM
Kd
nM
EC50/IC50
nM
koff
s-1
kon
M-1s-1
pHTemp
°C
Cytochrome P450-C17 (CYP17A1)
(Bos taurus (Bovine))
BDBM330391
(US9725436, Entry 10)
Show SMILES Clc1cc(\C=C\c2ccc(cc2)N2CCN(CC2)C2=NCCO2)cc(c1)-c1ccncc1 |t:20|
Show InChI InChI=1S/C26H25ClN4O/c27-24-18-21(17-23(19-24)22-7-9-28-10-8-22)2-1-20-3-5-25(6-4-20)30-12-14-31(15-13-30)26-29-11-16-32-26/h1-10,17-19H,11-16H2/b2-1+
US Patent
n/an/a 5n/an/an/an/an/an/a
CORTENDO AB (PUBL)
US Patent
Assay Description
Cyp17 assay protocol: AD293 cells that stably over-express recombinant CYP-17 were seeded in 96 well plates coated with poly D-lysine (15,000 cell pe...
US Patent US9725436 (2017)
BindingDB Entry DOI: 10.7270/Q2KD211N
Cytochrome P450 17A1
(Homo sapiens (Human))
BDBM330391
(US9725436, Entry 10)
Show SMILES Clc1cc(\C=C\c2ccc(cc2)N2CCN(CC2)C2=NCCO2)cc(c1)-c1ccncc1 |t:20|
Show InChI InChI=1S/C26H25ClN4O/c27-24-18-21(17-23(19-24)22-7-9-28-10-8-22)2-1-20-3-5-25(6-4-20)30-12-14-31(15-13-30)26-29-11-16-32-26/h1-10,17-19H,11-16H2/b2-1+
Reactome pathway
n/an/a 5n/an/an/an/an/an/a
Temple University School of Pharmacy
Curated by ChEMBL
Assay Description
Inhibition of recombinant CYP17 (unknown origin) expressed in human AD293 cells using [21-3H]17alpha-hydroxypregnenolone as substrate preincubated fo...
Bioorg Med Chem Lett 28: 2270-2274 (2018)
Article DOI: 10.1016/j.bmcl.2018.05.040
BindingDB Entry DOI: 10.7270/Q2RJ4N0B
Cytochrome P450-C17 (CYP17A1)
(Bos taurus (Bovine))
BDBM330391
(US9725436, Entry 10)
Show SMILES Clc1cc(\C=C\c2ccc(cc2)N2CCN(CC2)C2=NCCO2)cc(c1)-c1ccncc1 |t:20|
Show InChI InChI=1S/C26H25ClN4O/c27-24-18-21(17-23(19-24)22-7-9-28-10-8-22)2-1-20-3-5-25(6-4-20)30-12-14-31(15-13-30)26-29-11-16-32-26/h1-10,17-19H,11-16H2/b2-1+
US Patent
n/an/a 1.20E+3n/an/an/an/an/an/a
CORTENDO AB (PUBL)
US Patent
Assay Description
Cyp21 assay protocol: AD293 cells that stably over-express recombinant CYP-21 were seeded in 96 well plates coated with poly D-lysine (10,000 cell pe...
US Patent US9725436 (2017)
BindingDB Entry DOI: 10.7270/Q2KD211N
Cytochrome P450 11A1 (CYP11A1)
(Bos taurus (Bovine))
BDBM330391
(US9725436, Entry 10)
Show SMILES Clc1cc(\C=C\c2ccc(cc2)N2CCN(CC2)C2=NCCO2)cc(c1)-c1ccncc1 |t:20|
Show InChI InChI=1S/C26H25ClN4O/c27-24-18-21(17-23(19-24)22-7-9-28-10-8-22)2-1-20-3-5-25(6-4-20)30-12-14-31(15-13-30)26-29-11-16-32-26/h1-10,17-19H,11-16H2/b2-1+
US Patent
n/an/a 3.50E+3n/an/an/an/an/an/a
CORTENDO AB (PUBL)
US Patent
Assay Description
Cyp11 assay protocol: AD293 cells that stably over-express recombinant CYP-11 were seeded in 96 well plates coated with poly D-lysine (15,000 cell pe...
US Patent US9725436 (2017)
BindingDB Entry DOI: 10.7270/Q2KD211N