BDBM33107 2-chloranyl-3-[[4-(diethylamino)phenyl]amino]naphthalene-1,4-dione::2-chloro-3-[4-(diethylamino)anilino]-1,4-naphthoquinone::2-chloro-3-[4-(diethylamino)anilino]naphthalene-1,4-dione::2-chloro-3-{[4-(diethylamino)phenyl]amino}naphthoquinone::MLS000595078::SMR000184814::cid_1380424
SMILES: CCN(CC)c1ccc(NC2=C(Cl)C(=O)c3ccccc3C2=O)cc1
InChI Key: InChIKey=ZREQSHQZNKPOIB-UHFFFAOYSA-N
Data: 2 IC50  3 EC50
Activity Spreadsheet -- Enzyme Inhibition Constant Data from BindingDB
Found 5 hits for monomerid = 33107
Trg + Lig
Ki
nM
ΔG°
kcal/mole
IC50
nM
Kd
nM
EC50/IC50
nM
koff
s-1
kon
M-1s-1
pHTemp
°C
Bcl-2-related protein A1
(Homo sapiens (Human))
BDBM33107
(2-chloranyl-3-[[4-(diethylamino)phenyl]amino]napht...)
Show SMILES CCN(CC)c1ccc(NC2=C(Cl)C(=O)c3ccccc3C2=O)cc1 |c:10|
Show InChI InChI=1S/C20H19ClN2O2/c1-3-23(4-2)14-11-9-13(10-12-14)22-18-17(21)19(24)15-7-5-6-8-16(15)20(18)25/h5-12,22H,3-4H2,1-2H3
NCI pathway
PCBioAssay
n/an/an/an/a 180n/an/a7.44
NMMLSC
Curated by PubChem BioAssay
Assay Description
The multiplex is constructed by using beads for each protein target that have been labeled with varying intensities of red color, so that each assay ...
PubChem Bioassay (2008)
BindingDB Entry DOI: 10.7270/Q2CN728N
glutathione S-transferase
(Homo sapiens (Human))
BDBM33107
(2-chloranyl-3-[[4-(diethylamino)phenyl]amino]napht...)
Show SMILES CCN(CC)c1ccc(NC2=C(Cl)C(=O)c3ccccc3C2=O)cc1 |c:10|
Show InChI InChI=1S/C20H19ClN2O2/c1-3-23(4-2)14-11-9-13(10-12-14)22-18-17(21)19(24)15-7-5-6-8-16(15)20(18)25/h5-12,22H,3-4H2,1-2H3
NCI pathway
Reactome pathway
PCBioAssay
n/an/an/an/a 3.04E+3n/an/an/an/a
NMMLSC
Curated by PubChem BioAssay
Assay Description
University of New Mexico Assay Overview: Assay Support: NIH 1X01 MH079850-01 HTS to identify small molecule regulators of Bcl-2 family protein int...
PubChem Bioassay (2008)
BindingDB Entry DOI: 10.7270/Q2M61HPT
neutrophil cytosolic factor 1
(Homo sapiens (Human))
BDBM33107
(2-chloranyl-3-[[4-(diethylamino)phenyl]amino]napht...)
Show SMILES CCN(CC)c1ccc(NC2=C(Cl)C(=O)c3ccccc3C2=O)cc1 |c:10|
Show InChI InChI=1S/C20H19ClN2O2/c1-3-23(4-2)14-11-9-13(10-12-14)22-18-17(21)19(24)15-7-5-6-8-16(15)20(18)25/h5-12,22H,3-4H2,1-2H3
Reactome pathway
PCBioAssay
n/an/a 5.00E+4n/an/an/an/an/an/a
Emory University Molecular Libraries Screening Center
Curated by PubChem BioAssay
Assay Description
NIH Molecular Libraries Screening Centers Network [MLSCN] Emory Chemical Biology Discovery Center in MLSCN Assay provider: Susan Smith, Emory Univers...
PubChem Bioassay (2008)
BindingDB Entry DOI: 10.7270/Q2M90723
Induced myeloid leukemia cell differentiation protein Mcl-1
(Homo sapiens (Human))
BDBM33107
(2-chloranyl-3-[[4-(diethylamino)phenyl]amino]napht...)
Show SMILES CCN(CC)c1ccc(NC2=C(Cl)C(=O)c3ccccc3C2=O)cc1 |c:10|
Show InChI InChI=1S/C20H19ClN2O2/c1-3-23(4-2)14-11-9-13(10-12-14)22-18-17(21)19(24)15-7-5-6-8-16(15)20(18)25/h5-12,22H,3-4H2,1-2H3
NCI pathway
PCBioAssay
n/an/a 1.47E+3n/an/an/an/an/an/a
Emory University Molecular Libraries Screening Center
Curated by PubChem BioAssay
Assay Description
NIH Molecular Libraries Screening Centers Network [MLSCN] Emory Chemical Biology Discovery Center in MLSCN Assay provider: Nikolovska-Coleska, Univer...
PubChem Bioassay (2008)
BindingDB Entry DOI: 10.7270/Q23X8539
BCL-W
(Homo sapiens (Human))
BDBM33107
(2-chloranyl-3-[[4-(diethylamino)phenyl]amino]napht...)
Show SMILES CCN(CC)c1ccc(NC2=C(Cl)C(=O)c3ccccc3C2=O)cc1 |c:10|
Show InChI InChI=1S/C20H19ClN2O2/c1-3-23(4-2)14-11-9-13(10-12-14)22-18-17(21)19(24)15-7-5-6-8-16(15)20(18)25/h5-12,22H,3-4H2,1-2H3
PCBioAssay
n/an/an/an/a 170n/an/an/an/a
NMMLSC
Curated by PubChem BioAssay
Assay Description
University of New Mexico Assay Overview: Assay Support: NIH 1X01 MH079850-01 HTS to identify small molecule regulators of Bcl-2 family protein int...
PubChem Bioassay (2008)
BindingDB Entry DOI: 10.7270/Q2BR8QM3